{"text_format":"1","workbook":"xlsx","n_sheets":16,"sheets":["Application","ACS580","ACS550","DriveSel","TypeListTemplate","ACS55","ACS150","ACS310","ACS355","Language","ACS800","ACS880","ACQ810","StdDrives","calcPump","Settings"],"not_rendered":{"charts":4,"images":56,"macros":1,"external_links":1,"defined_names":113,"comments":14,"pivot_tables":0},"unopened":[],"bounds":{"document_bytes":16777216,"sheet_cells":100000,"rows_first":2000,"rows_last":500,"rows_between":2000,"halvings":0,"cell_chars":16384,"cell_head_chars":4096},"cells_cut":0,"cells_raw":0,"read":"whole","date_system":"1900"}

{"sheet":"Application","index":0,"n_rows":0,"n_cols":0,"rows_kept":0,"cut":false,"hidden":false,"merged":[]}

{"sheet":"ACS580","index":1,"n_rows":95,"n_cols":17,"rows_kept":95,"cut":false,"hidden":true,"merged":[]}
["Typecode","Prod.class",null,"Voltage range 1",null,"Voltage range 2 (1-ph)",null,"Voltage range 2",null,"Voltage range 3",null,"Voltage range 4.6",null,"Voltage range 5",null,"Voltage range 7/6"]
[{"$f":"VLOOKUP(DriveSel!E20,C8:Y71,DriveSel!D18)","v":"ACS580-01-246A-4"},{"$f":"VLOOKUP(#REF!,C8:X70,7)","v":{"$error":"#REF!"}},"non-US (50Hz)"," 115 V (1-ph)",null," 230 V (1-ph)",null," 230 V (3-ph)",null," 400 V",null," 460 V",null," 500 V",null," 690 V"]
["Col.ordinal","Col.ordinal"]
[null,null,"Alternatives:","115 V 1-ph",null,"200/208/230/240 V 1-ph",null,"200/208/230/240 V 3-ph",null,"380/400/415 V",null,"440/460/480 V",null,"500 V",null,"525/550/575/600/660/690 V"]
["Motor Power","Motor",null,"Drive type",null,"Drive type",null,"Drive type",null,"Drive type",null,"Drive type",null,"Drive type",null,"Drive type"]
[{"$f":"TypeListTemplate!A6","v":"Hp"},{"$f":"TypeListTemplate!B6","v":"power kW"}]
[{"$f":"TypeListTemplate!A7","v":0},{"$f":"TypeListTemplate!B7","v":"Column Ordinal ->"},{"$f":"TypeListTemplate!C7","v":1},{"$f":"TypeListTemplate!D7","v":2},{"$f":"TypeListTemplate!E7","v":3},{"$f":"TypeListTemplate!F7","v":4},{"$f":"TypeListTemplate!G7","v":5},{"$f":"TypeListTemplate!H7","v":6},{"$f":"TypeListTemplate!I7","v":7},{"$f":"TypeListTemplate!J7","v":8},{"$f":"TypeListTemplate!K7","v":9},{"$f":"TypeListTemplate!L7","v":10},{"$f":"TypeListTemplate!M7","v":11},{"$f":"TypeListTemplate!N7","v":12},{"$f":"TypeListTemplate!O7","v":13},{"$f":"TypeListTemplate!P7","v":14},{"$f":"TypeListTemplate!Q7","v":15}]
[{"$f":"TypeListTemplate!A8","v":0},{"$f":"TypeListTemplate!B8","v":0},{"$f":"TypeListTemplate!C8","v":0}]
[{"$f":"TypeListTemplate!A9","v":7.3756202226096287E-2},{"$f":"TypeListTemplate!B9","v":5.5E-2},{"$f":"TypeListTemplate!C9","v":0.01}]
[{"$f":"TypeListTemplate!A10","v":0.12069196727906664},{"$f":"TypeListTemplate!B10","v":0.09},{"$f":"TypeListTemplate!C10","v":6.5000000000000002E-2}]
[{"$f":"TypeListTemplate!A11","v":0.16092262303875551},{"$f":"TypeListTemplate!B11","v":0.12},{"$f":"TypeListTemplate!C11","v":9.9999999999999992E-2}]
[{"$f":"TypeListTemplate!A12","v":0.24138393455813328},{"$f":"TypeListTemplate!B12","v":0.18},{"$f":"TypeListTemplate!C12","v":0.13}]
[{"$f":"TypeListTemplate!A13","v":0.49617808770282951},{"$f":"TypeListTemplate!B13","v":0.37},{"$f":"TypeListTemplate!C13","v":0.19}]
[{"$f":"TypeListTemplate!A14","v":0.7375620222609629},{"$f":"TypeListTemplate!B14","v":0.55000000000000004},{"$f":"TypeListTemplate!C14","v":0.38}]
[{"$f":"TypeListTemplate!A15","v":1.0057663939922221},{"$f":"TypeListTemplate!B15","v":0.75},{"$f":"TypeListTemplate!C15","v":0.56000000000000005},null,null,null,null,null,null,"ACS580-01-02A6-4",null,"ACS580-01-02A6-4"]
[{"$f":"TypeListTemplate!A16","v":1.4751240445219258},{"$f":"TypeListTemplate!B16","v":1.1000000000000001},{"$f":"TypeListTemplate!C16","v":0.76},null,null,null,null,null,null,"ACS580-01-03A3-4",null,"ACS580-01-03A3-4"]
[{"$f":"TypeListTemplate!A17","v":2.0115327879844442},{"$f":"TypeListTemplate!B17","v":1.5},{"$f":"TypeListTemplate!C17","v":1.1100000000000001},null,null,null,null,null,null,"ACS580-01-04A0-4",null,"ACS580-01-04A0-4"]
[{"$f":"TypeListTemplate!A18","v":2.9502480890438516},{"$f":"TypeListTemplate!B18","v":2.2000000000000002},{"$f":"TypeListTemplate!C18","v":1.51},null,null,null,null,null,null,"ACS580-01-05A6-4",null,"ACS580-01-05A6-4"]
[{"$f":"TypeListTemplate!A19","v":4.0230655759688885},{"$f":"TypeListTemplate!B19","v":3},{"$f":"TypeListTemplate!C19","v":2.21},null,null,null,null,null,null,"ACS580-01-07A2-4",null,"ACS580-01-07A2-4"]
[{"$f":"TypeListTemplate!A20","v":5},{"$f":"TypeListTemplate!B20","v":3.7285000000000004},{"$f":"TypeListTemplate!C20","v":3.01},null,null,null,null,null,null,"ACS580-01-09A4-4",null,"ACS580-01-09A4-4"]
[{"$f":"TypeListTemplate!A21","v":5.3640874346251843},{"$f":"TypeListTemplate!B21","v":4},{"$f":"TypeListTemplate!C21","v":3.7385000000000002},null,null,null,null,null,null,"ACS580-01-09A4-4",null,"ACS580-01-09A4-4"]
[{"$f":"TypeListTemplate!A22","v":7.3756202226096281},{"$f":"TypeListTemplate!B22","v":5.5},{"$f":"TypeListTemplate!C22","v":4.01},null,null,null,null,null,null,"ACS580-01-12A6-4",null,"ACS580-01-12A6-4"]
[{"$f":"TypeListTemplate!A23","v":10.05766393992222},{"$f":"TypeListTemplate!B23","v":7.5},{"$f":"TypeListTemplate!C23","v":5.51},null,null,null,null,null,null,"ACS580-01-017A-4",null,"ACS580-01-017A-4"]
[{"$f":"TypeListTemplate!A24","v":14.751240445219256},{"$f":"TypeListTemplate!B24","v":11},{"$f":"TypeListTemplate!C24","v":7.51},null,null,null,null,null,null,"ACS580-01-025A-4",null,"ACS580-01-025A-4"]
[{"$f":"TypeListTemplate!A25","v":20.11532787984444},{"$f":"TypeListTemplate!B25","v":15},{"$f":"TypeListTemplate!C25","v":11.01},null,null,null,null,null,null,"ACS580-01-032A-4",null,"ACS580-01-032A-4"]
[{"$f":"TypeListTemplate!A26","v":24.808904385141478},{"$f":"TypeListTemplate!B26","v":18.5},{"$f":"TypeListTemplate!C26","v":15.01},null,null,null,null,null,null,"ACS580-01-038A-4",null,"ACS580-01-038A-4"]
[{"$f":"TypeListTemplate!A27","v":29.502480890438513},{"$f":"TypeListTemplate!B27","v":22},{"$f":"TypeListTemplate!C27","v":18.510000000000002},null,null,null,null,null,null,"ACS580-01-045A-4",null,"ACS580-01-045A-4"]
[{"$f":"TypeListTemplate!A28","v":40.230655759688879},{"$f":"TypeListTemplate!B28","v":30},{"$f":"TypeListTemplate!C28","v":22.01},null,null,null,null,null,null,"ACS580-01-061A-4",null,"ACS580-01-061A-4"]
[{"$f":"TypeListTemplate!A29","v":49.617808770282956},{"$f":"TypeListTemplate!B29","v":37},{"$f":"TypeListTemplate!C29","v":30.01},null,null,null,null,null,null,"ACS580-01-072A-4",null,"ACS580-01-072A-4"]
[{"$f":"TypeListTemplate!A30","v":60.345983639533323},{"$f":"TypeListTemplate!B30","v":45},{"$f":"TypeListTemplate!C30","v":37.01},null,null,null,null,null,null,"ACS580-01-087A-4",null,"ACS580-01-087A-4"]
[{"$f":"TypeListTemplate!A31","v":73.756202226096278},{"$f":"TypeListTemplate!B31","v":55},{"$f":"TypeListTemplate!C31","v":45.01},null,null,null,null,null,null,"ACS580-01-105A-4",null,"ACS580-01-105A-4"]
[{"$f":"TypeListTemplate!A32","v":100.5766393992222},{"$f":"TypeListTemplate!B32","v":75},{"$f":"TypeListTemplate!C32","v":55.01},null,null,null,null,null,null,"ACS580-01-145A-4",null,"ACS580-01-145A-4"]
[{"$f":"TypeListTemplate!A33","v":120.69196727906665},{"$f":"TypeListTemplate!B33","v":90},{"$f":"TypeListTemplate!C33","v":75.010000000000005},null,null,null,null,null,null,"ACS580-01-169A-4",null,"ACS580-01-169A-4"]
[{"$f":"TypeListTemplate!A34","v":147.51240445219256},{"$f":"TypeListTemplate!B34","v":110},{"$f":"TypeListTemplate!C34","v":90.01},null,null,null,null,null,null,"ACS580-01-206A-4",null,"ACS580-01-206A-4"]
[{"$f":"TypeListTemplate!A35","v":177.01488534263109},{"$f":"TypeListTemplate!B35","v":132},{"$f":"TypeListTemplate!C35","v":110.01},null,null,null,null,null,null,"ACS580-01-246A-4",null,"ACS580-01-246A-4"]
[{"$f":"TypeListTemplate!A36","v":200},{"$f":"TypeListTemplate!B36","v":149.14000000000001},{"$f":"TypeListTemplate!C36","v":132.01},null,null,null,null,null,null,"ACS580-01-293A-4",null,"ACS580-01-293A-4"]
[{"$f":"TypeListTemplate!A37","v":214.56349738500737},{"$f":"TypeListTemplate!B37","v":160},{"$f":"TypeListTemplate!C37","v":149.15},null,null,null,null,null,null,"ACS580-01-293A-4",null,"ACS580-01-293A-4"]
[{"$f":"TypeListTemplate!A38","v":250},{"$f":"TypeListTemplate!B38","v":186.42500000000001},{"$f":"TypeListTemplate!C38","v":160.01},null,null,null,null,null,null,"ACS580-01-363A-4",null,"ACS580-01-363A-4"]
[{"$f":"TypeListTemplate!A39","v":268.20437173125919},{"$f":"TypeListTemplate!B39","v":200},{"$f":"TypeListTemplate!C39","v":186.435},null,null,null,null,null,null,"ACS580-01-363A-4",null,"ACS580-01-363A-4"]
[{"$f":"TypeListTemplate!A40","v":300},{"$f":"TypeListTemplate!B40","v":223.71},{"$f":"TypeListTemplate!C40","v":200.01},null,null,null,null,null,null,"ACS580-01-430A-4",null,"ACS580-01-430A-4"]
[{"$f":"TypeListTemplate!A41","v":335.255464664074},{"$f":"TypeListTemplate!B41","v":250},{"$f":"TypeListTemplate!C41","v":223.72},null,null,null,null,null,null,"ACS580-01-430A-4",null,"ACS580-01-430A-4"]
[{"$f":"TypeListTemplate!A42","v":400},{"$f":"TypeListTemplate!B42","v":298.28000000000003},{"$f":"TypeListTemplate!C42","v":250.01}]
[{"$f":"TypeListTemplate!A43","v":422.42188547673328},{"$f":"TypeListTemplate!B43","v":315},{"$f":"TypeListTemplate!C43","v":298.29000000000002}]
[{"$f":"TypeListTemplate!A44","v":476.06275982298507},{"$f":"TypeListTemplate!B44","v":355},{"$f":"TypeListTemplate!C44","v":315.01}]
[{"$f":"TypeListTemplate!A45","v":536.40874346251837},{"$f":"TypeListTemplate!B45","v":400},{"$f":"TypeListTemplate!C45","v":355.01}]
[{"$f":"TypeListTemplate!A46","v":603.45983639533324},{"$f":"TypeListTemplate!B46","v":450},{"$f":"TypeListTemplate!C46","v":400.01}]
[{"$f":"TypeListTemplate!A47","v":670.51092932814799},{"$f":"TypeListTemplate!B47","v":500},{"$f":"TypeListTemplate!C47","v":450.01}]
[{"$f":"TypeListTemplate!A48","v":750.97224084752577},{"$f":"TypeListTemplate!B48","v":560},{"$f":"TypeListTemplate!C48","v":500.01}]
[{"$f":"TypeListTemplate!A49","v":844.84377095346656},{"$f":"TypeListTemplate!B49","v":630},{"$f":"TypeListTemplate!C49","v":560.01}]
[{"$f":"TypeListTemplate!A50","v":952.12551964597014},{"$f":"TypeListTemplate!B50","v":710},{"$f":"TypeListTemplate!C50","v":630.01}]
[{"$f":"TypeListTemplate!A51","v":1072.8174869250367},{"$f":"TypeListTemplate!B51","v":800},{"$f":"TypeListTemplate!C51","v":710.01}]
[{"$f":"TypeListTemplate!A52","v":1206.9196727906665},{"$f":"TypeListTemplate!B52","v":900},{"$f":"TypeListTemplate!C52","v":800.01}]
[{"$f":"TypeListTemplate!A53","v":1341.021858656296},{"$f":"TypeListTemplate!B53","v":1000},{"$f":"TypeListTemplate!C53","v":900.01}]
[{"$f":"TypeListTemplate!A54","v":1501.9444816950515},{"$f":"TypeListTemplate!B54","v":1120},{"$f":"TypeListTemplate!C54","v":1000.01}]
[{"$f":"TypeListTemplate!A55","v":1676.27732332037},{"$f":"TypeListTemplate!B55","v":1250},{"$f":"TypeListTemplate!C55","v":1120.01}]
[{"$f":"TypeListTemplate!A56","v":1877.4306021188145},{"$f":"TypeListTemplate!B56","v":1400},{"$f":"TypeListTemplate!C56","v":1250.01}]
[{"$f":"TypeListTemplate!A57","v":2145.6349738500735},{"$f":"TypeListTemplate!B57","v":1600},{"$f":"TypeListTemplate!C57","v":1400.01}]
[{"$f":"TypeListTemplate!A58","v":2346.7882526485182},{"$f":"TypeListTemplate!B58","v":1750},{"$f":"TypeListTemplate!C58","v":1600.01}]
[{"$f":"TypeListTemplate!A59","v":2413.839345581333},{"$f":"TypeListTemplate!B59","v":1800},{"$f":"TypeListTemplate!C59","v":1750.01}]
[{"$f":"TypeListTemplate!A60","v":2682.043717312592},{"$f":"TypeListTemplate!B60","v":2000},{"$f":"TypeListTemplate!C60","v":1800.01}]
[{"$f":"TypeListTemplate!A61","v":2950.2480890438515},{"$f":"TypeListTemplate!B61","v":2200},{"$f":"TypeListTemplate!C61","v":2000.01}]
[{"$f":"TypeListTemplate!A62","v":3017.2991819766662},{"$f":"TypeListTemplate!B62","v":2250},{"$f":"TypeListTemplate!C62","v":2200.0100000000002}]
[{"$f":"TypeListTemplate!A63","v":3084.350274909481},{"$f":"TypeListTemplate!B63","v":2300},{"$f":"TypeListTemplate!C63","v":2250.0100000000002}]
[{"$f":"TypeListTemplate!A64","v":3352.55464664074},{"$f":"TypeListTemplate!B64","v":2500},{"$f":"TypeListTemplate!C64","v":2300.0100000000002}]
[{"$f":"TypeListTemplate!A65","v":3754.861204237629},{"$f":"TypeListTemplate!B65","v":2800},{"$f":"TypeListTemplate!C65","v":2500.0100000000002}]
[{"$f":"TypeListTemplate!A66","v":4224.2188547673322},{"$f":"TypeListTemplate!B66","v":3150},{"$f":"TypeListTemplate!C66","v":2800.01}]
[{"$f":"TypeListTemplate!A67","v":4760.6275982298512},{"$f":"TypeListTemplate!B67","v":3550},{"$f":"TypeListTemplate!C67","v":3150.01}]
[{"$f":"TypeListTemplate!A68","v":5364.087434625184},{"$f":"TypeListTemplate!B68","v":4000},{"$f":"TypeListTemplate!C68","v":3550.01}]
[{"$f":"TypeListTemplate!A69","v":6034.5983639533324},{"$f":"TypeListTemplate!B69","v":4500},{"$f":"TypeListTemplate!C69","v":4000.01}]
[{"$f":"TypeListTemplate!A70","v":6705.1092932814799},{"$f":"TypeListTemplate!B70","v":5000},{"$f":"TypeListTemplate!C70","v":4500.01}]
[{"$f":"TypeListTemplate!A71","v":0},{"$f":"TypeListTemplate!B71","v":999999999},{"$f":"TypeListTemplate!C71","v":5000.01}]
[{"$f":"TypeListTemplate!A72","v":0},{"$f":"TypeListTemplate!B72","v":0},{"$f":"TypeListTemplate!C72","v":0}]
[{"$f":"TypeListTemplate!A73","v":0},{"$f":"TypeListTemplate!B73","v":0},{"$f":"TypeListTemplate!C73","v":0},{"$f":"TypeListTemplate!D73","v":"Drive type"},{"$f":"TypeListTemplate!E73","v":0},{"$f":"TypeListTemplate!F73","v":"Drive type"},{"$f":"TypeListTemplate!G73","v":0},{"$f":"TypeListTemplate!H73","v":"Drive type"},{"$f":"TypeListTemplate!I73","v":0},{"$f":"TypeListTemplate!J73","v":"Drive type"},{"$f":"TypeListTemplate!K73","v":0},{"$f":"TypeListTemplate!L73","v":"Drive type"},{"$f":"TypeListTemplate!M73","v":0},{"$f":"TypeListTemplate!N73","v":"Drive type"},{"$f":"TypeListTemplate!O73","v":0},{"$f":"TypeListTemplate!P73","v":"Drive type"},{"$f":"TypeListTemplate!Q73","v":0}]
[{"$f":"TypeListTemplate!A74","v":0},{"$f":"TypeListTemplate!B74","v":0},{"$f":"TypeListTemplate!C74","v":0},{"$f":"TypeListTemplate!D74","v":" 115 V (1-ph)"},{"$f":"TypeListTemplate!E74","v":0},{"$f":"TypeListTemplate!F74","v":" 230 V (1-ph)"},{"$f":"TypeListTemplate!G74","v":0},{"$f":"TypeListTemplate!H74","v":" 230 V (3-ph)"},{"$f":"TypeListTemplate!I74","v":0},{"$f":"TypeListTemplate!J74","v":" 400 V"},{"$f":"TypeListTemplate!K74","v":0},{"$f":"TypeListTemplate!L74","v":" 460 V"},{"$f":"TypeListTemplate!M74","v":0},{"$f":"TypeListTemplate!N74","v":" 500 V"},{"$f":"TypeListTemplate!O74","v":0},{"$f":"TypeListTemplate!P74","v":" 690 V"},{"$f":"TypeListTemplate!Q74","v":0}]
[{"$f":"TypeListTemplate!A75","v":0},{"$f":"TypeListTemplate!B75","v":0},{"$f":"TypeListTemplate!C75","v":0},{"$f":"TypeListTemplate!D75","v":0},{"$f":"TypeListTemplate!E75","v":0},{"$f":"TypeListTemplate!F75","v":0},{"$f":"TypeListTemplate!G75","v":0},{"$f":"TypeListTemplate!H75","v":0},{"$f":"TypeListTemplate!I75","v":0},{"$f":"TypeListTemplate!J75","v":0},{"$f":"TypeListTemplate!K75","v":0},{"$f":"TypeListTemplate!L75","v":0},{"$f":"TypeListTemplate!M75","v":0},{"$f":"TypeListTemplate!N75","v":0},{"$f":"TypeListTemplate!O75","v":0},{"$f":"TypeListTemplate!P75","v":0},{"$f":"TypeListTemplate!Q75","v":0}]
[{"$f":"TypeListTemplate!A76","v":0},{"$f":"TypeListTemplate!B76","v":0},{"$f":"TypeListTemplate!C76","v":0},{"$f":"TypeListTemplate!D76","v":0},{"$f":"TypeListTemplate!E76","v":0},{"$f":"TypeListTemplate!F76","v":0},{"$f":"TypeListTemplate!G76","v":0},{"$f":"TypeListTemplate!H76","v":0},{"$f":"TypeListTemplate!I76","v":0},{"$f":"TypeListTemplate!J76","v":0},{"$f":"TypeListTemplate!K76","v":0},{"$f":"TypeListTemplate!L76","v":0},{"$f":"TypeListTemplate!M76","v":0},{"$f":"TypeListTemplate!N76","v":0},{"$f":"TypeListTemplate!O76","v":0},{"$f":"TypeListTemplate!P76","v":0},{"$f":"TypeListTemplate!Q76","v":0}]
[{"$f":"TypeListTemplate!A77","v":0},{"$f":"TypeListTemplate!B77","v":0},{"$f":"TypeListTemplate!C77","v":0},{"$f":"TypeListTemplate!D77","v":0},{"$f":"TypeListTemplate!E77","v":0},{"$f":"TypeListTemplate!F77","v":0},{"$f":"TypeListTemplate!G77","v":0},{"$f":"TypeListTemplate!H77","v":0},{"$f":"TypeListTemplate!I77","v":0},{"$f":"TypeListTemplate!J77","v":0},{"$f":"TypeListTemplate!K77","v":0},{"$f":"TypeListTemplate!L77","v":0},{"$f":"TypeListTemplate!M77","v":0},{"$f":"TypeListTemplate!N77","v":0},{"$f":"TypeListTemplate!O77","v":0},{"$f":"TypeListTemplate!P77","v":0},{"$f":"TypeListTemplate!Q77","v":0}]
[{"$f":"TypeListTemplate!A78","v":0},{"$f":"TypeListTemplate!B78","v":0},{"$f":"TypeListTemplate!C78","v":0},{"$f":"TypeListTemplate!D78","v":0},{"$f":"TypeListTemplate!E78","v":0},{"$f":"TypeListTemplate!F78","v":0},{"$f":"TypeListTemplate!G78","v":0},{"$f":"TypeListTemplate!H78","v":0},{"$f":"TypeListTemplate!I78","v":0},{"$f":"TypeListTemplate!J78","v":0},{"$f":"TypeListTemplate!K78","v":0},{"$f":"TypeListTemplate!L78","v":0},{"$f":"TypeListTemplate!M78","v":0},{"$f":"TypeListTemplate!N78","v":0},{"$f":"TypeListTemplate!O78","v":0},{"$f":"TypeListTemplate!P78","v":0},{"$f":"TypeListTemplate!Q78","v":0}]
[{"$f":"TypeListTemplate!A79","v":0},{"$f":"TypeListTemplate!B79","v":0},{"$f":"TypeListTemplate!C79","v":0},{"$f":"TypeListTemplate!D79","v":0},{"$f":"TypeListTemplate!E79","v":0},{"$f":"TypeListTemplate!F79","v":0},{"$f":"TypeListTemplate!G79","v":0},{"$f":"TypeListTemplate!H79","v":0},{"$f":"TypeListTemplate!I79","v":0},{"$f":"TypeListTemplate!J79","v":0},{"$f":"TypeListTemplate!K79","v":0},{"$f":"TypeListTemplate!L79","v":0},{"$f":"TypeListTemplate!M79","v":0},{"$f":"TypeListTemplate!N79","v":0},{"$f":"TypeListTemplate!O79","v":0},{"$f":"TypeListTemplate!P79","v":0},{"$f":"TypeListTemplate!Q79","v":0}]
[{"$f":"TypeListTemplate!A80","v":0},{"$f":"TypeListTemplate!B80","v":0},{"$f":"TypeListTemplate!C80","v":0},{"$f":"TypeListTemplate!D80","v":0},{"$f":"TypeListTemplate!E80","v":0},{"$f":"TypeListTemplate!F80","v":0},{"$f":"TypeListTemplate!G80","v":0},{"$f":"TypeListTemplate!H80","v":0},{"$f":"TypeListTemplate!I80","v":0},{"$f":"TypeListTemplate!J80","v":0},{"$f":"TypeListTemplate!K80","v":0},{"$f":"TypeListTemplate!L80","v":0},{"$f":"TypeListTemplate!M80","v":0},{"$f":"TypeListTemplate!N80","v":0},{"$f":"TypeListTemplate!O80","v":0},{"$f":"TypeListTemplate!P80","v":0},{"$f":"TypeListTemplate!Q80","v":0}]
[{"$f":"TypeListTemplate!A81","v":0},{"$f":"TypeListTemplate!B81","v":0},{"$f":"TypeListTemplate!C81","v":0},{"$f":"TypeListTemplate!D81","v":0},{"$f":"TypeListTemplate!E81","v":0},{"$f":"TypeListTemplate!F81","v":0},{"$f":"TypeListTemplate!G81","v":0},{"$f":"TypeListTemplate!H81","v":0},{"$f":"TypeListTemplate!I81","v":0},{"$f":"TypeListTemplate!J81","v":0},{"$f":"TypeListTemplate!K81","v":0},{"$f":"TypeListTemplate!L81","v":0},{"$f":"TypeListTemplate!M81","v":0},{"$f":"TypeListTemplate!N81","v":0},{"$f":"TypeListTemplate!O81","v":0},{"$f":"TypeListTemplate!P81","v":0},{"$f":"TypeListTemplate!Q81","v":0}]
[{"$f":"TypeListTemplate!A82","v":0},{"$f":"TypeListTemplate!B82","v":0},{"$f":"TypeListTemplate!C82","v":0},{"$f":"TypeListTemplate!D82","v":0},{"$f":"TypeListTemplate!E82","v":0},{"$f":"TypeListTemplate!F82","v":0},{"$f":"TypeListTemplate!G82","v":0},{"$f":"TypeListTemplate!H82","v":0},{"$f":"TypeListTemplate!I82","v":0},{"$f":"TypeListTemplate!J82","v":0},{"$f":"TypeListTemplate!K82","v":0},{"$f":"TypeListTemplate!L82","v":0},{"$f":"TypeListTemplate!M82","v":0},{"$f":"TypeListTemplate!N82","v":0},{"$f":"TypeListTemplate!O82","v":0},{"$f":"TypeListTemplate!P82","v":0},{"$f":"TypeListTemplate!Q82","v":0}]
[{"$f":"TypeListTemplate!A83","v":0},{"$f":"TypeListTemplate!B83","v":0},{"$f":"TypeListTemplate!C83","v":0},{"$f":"TypeListTemplate!D83","v":0},{"$f":"TypeListTemplate!E83","v":0},{"$f":"TypeListTemplate!F83","v":0},{"$f":"TypeListTemplate!G83","v":0},{"$f":"TypeListTemplate!H83","v":0},{"$f":"TypeListTemplate!I83","v":0},{"$f":"TypeListTemplate!J83","v":0},{"$f":"TypeListTemplate!K83","v":0},{"$f":"TypeListTemplate!L83","v":0},{"$f":"TypeListTemplate!M83","v":0},{"$f":"TypeListTemplate!N83","v":0},{"$f":"TypeListTemplate!O83","v":0},{"$f":"TypeListTemplate!P83","v":0},{"$f":"TypeListTemplate!Q83","v":0}]
[{"$f":"TypeListTemplate!A84","v":0},{"$f":"TypeListTemplate!B84","v":0},{"$f":"TypeListTemplate!C84","v":0},{"$f":"TypeListTemplate!D84","v":0},{"$f":"TypeListTemplate!E84","v":0},{"$f":"TypeListTemplate!F84","v":0},{"$f":"TypeListTemplate!G84","v":0},{"$f":"TypeListTemplate!H84","v":0},{"$f":"TypeListTemplate!I84","v":0},{"$f":"TypeListTemplate!J84","v":0},{"$f":"TypeListTemplate!K84","v":0},{"$f":"TypeListTemplate!L84","v":0},{"$f":"TypeListTemplate!M84","v":0},{"$f":"TypeListTemplate!N84","v":0},{"$f":"TypeListTemplate!O84","v":0},{"$f":"TypeListTemplate!P84","v":0},{"$f":"TypeListTemplate!Q84","v":0}]
[{"$f":"TypeListTemplate!A85","v":0},{"$f":"TypeListTemplate!B85","v":0},{"$f":"TypeListTemplate!C85","v":0},{"$f":"TypeListTemplate!D85","v":0},{"$f":"TypeListTemplate!E85","v":0},{"$f":"TypeListTemplate!F85","v":0},{"$f":"TypeListTemplate!G85","v":0},{"$f":"TypeListTemplate!H85","v":0},{"$f":"TypeListTemplate!I85","v":0},{"$f":"TypeListTemplate!J85","v":0},{"$f":"TypeListTemplate!K85","v":0},{"$f":"TypeListTemplate!L85","v":0},{"$f":"TypeListTemplate!M85","v":0},{"$f":"TypeListTemplate!N85","v":0},{"$f":"TypeListTemplate!O85","v":0},{"$f":"TypeListTemplate!P85","v":0},{"$f":"TypeListTemplate!Q85","v":0}]
[{"$f":"TypeListTemplate!A86","v":0},{"$f":"TypeListTemplate!B86","v":0},{"$f":"TypeListTemplate!C86","v":0},{"$f":"TypeListTemplate!D86","v":0},{"$f":"TypeListTemplate!E86","v":0},{"$f":"TypeListTemplate!F86","v":0},{"$f":"TypeListTemplate!G86","v":0},{"$f":"TypeListTemplate!H86","v":0},{"$f":"TypeListTemplate!I86","v":0},{"$f":"TypeListTemplate!J86","v":0},{"$f":"TypeListTemplate!K86","v":0},{"$f":"TypeListTemplate!L86","v":0},{"$f":"TypeListTemplate!M86","v":0},{"$f":"TypeListTemplate!N86","v":0},{"$f":"TypeListTemplate!O86","v":0},{"$f":"TypeListTemplate!P86","v":0},{"$f":"TypeListTemplate!Q86","v":0}]
[{"$f":"TypeListTemplate!A87","v":0},{"$f":"TypeListTemplate!B87","v":0},{"$f":"TypeListTemplate!C87","v":0},{"$f":"TypeListTemplate!D87","v":0},{"$f":"TypeListTemplate!E87","v":0},{"$f":"TypeListTemplate!F87","v":0},{"$f":"TypeListTemplate!G87","v":0},{"$f":"TypeListTemplate!H87","v":0},{"$f":"TypeListTemplate!I87","v":0},{"$f":"TypeListTemplate!J87","v":0},{"$f":"TypeListTemplate!K87","v":0},{"$f":"TypeListTemplate!L87","v":0},{"$f":"TypeListTemplate!M87","v":0},{"$f":"TypeListTemplate!N87","v":0},{"$f":"TypeListTemplate!O87","v":0},{"$f":"TypeListTemplate!P87","v":0},{"$f":"TypeListTemplate!Q87","v":0}]
[{"$f":"TypeListTemplate!A88","v":0},{"$f":"TypeListTemplate!B88","v":0},{"$f":"TypeListTemplate!C88","v":0},{"$f":"TypeListTemplate!D88","v":0},{"$f":"TypeListTemplate!E88","v":0},{"$f":"TypeListTemplate!F88","v":0},{"$f":"TypeListTemplate!G88","v":0},{"$f":"TypeListTemplate!H88","v":0},{"$f":"TypeListTemplate!I88","v":0},{"$f":"TypeListTemplate!J88","v":0},{"$f":"TypeListTemplate!K88","v":0},{"$f":"TypeListTemplate!L88","v":0},{"$f":"TypeListTemplate!M88","v":0},{"$f":"TypeListTemplate!N88","v":0},{"$f":"TypeListTemplate!O88","v":0},{"$f":"TypeListTemplate!P88","v":0},{"$f":"TypeListTemplate!Q88","v":0}]
[{"$f":"TypeListTemplate!A89","v":0},{"$f":"TypeListTemplate!B89","v":0},{"$f":"TypeListTemplate!C89","v":0},{"$f":"TypeListTemplate!D89","v":0},{"$f":"TypeListTemplate!E89","v":0},{"$f":"TypeListTemplate!F89","v":0},{"$f":"TypeListTemplate!G89","v":0},{"$f":"TypeListTemplate!H89","v":0},{"$f":"TypeListTemplate!I89","v":0},{"$f":"TypeListTemplate!J89","v":0},{"$f":"TypeListTemplate!K89","v":0},{"$f":"TypeListTemplate!L89","v":0},{"$f":"TypeListTemplate!M89","v":0},{"$f":"TypeListTemplate!N89","v":0},{"$f":"TypeListTemplate!O89","v":0},{"$f":"TypeListTemplate!P89","v":0},{"$f":"TypeListTemplate!Q89","v":0}]
[{"$f":"TypeListTemplate!A90","v":0},{"$f":"TypeListTemplate!B90","v":0},{"$f":"TypeListTemplate!C90","v":0},{"$f":"TypeListTemplate!D90","v":0},{"$f":"TypeListTemplate!E90","v":0},{"$f":"TypeListTemplate!F90","v":0},{"$f":"TypeListTemplate!G90","v":0},{"$f":"TypeListTemplate!H90","v":0},{"$f":"TypeListTemplate!I90","v":0},{"$f":"TypeListTemplate!J90","v":0},{"$f":"TypeListTemplate!K90","v":0},{"$f":"TypeListTemplate!L90","v":0},{"$f":"TypeListTemplate!M90","v":0},{"$f":"TypeListTemplate!N90","v":0},{"$f":"TypeListTemplate!O90","v":0},{"$f":"TypeListTemplate!P90","v":0},{"$f":"TypeListTemplate!Q90","v":0}]
[{"$f":"TypeListTemplate!A91","v":0},{"$f":"TypeListTemplate!B91","v":0},{"$f":"TypeListTemplate!C91","v":0},{"$f":"TypeListTemplate!D91","v":0},{"$f":"TypeListTemplate!E91","v":0},{"$f":"TypeListTemplate!F91","v":0},{"$f":"TypeListTemplate!G91","v":0},{"$f":"TypeListTemplate!H91","v":0},{"$f":"TypeListTemplate!I91","v":0},{"$f":"TypeListTemplate!J91","v":0},{"$f":"TypeListTemplate!K91","v":0},{"$f":"TypeListTemplate!L91","v":0},{"$f":"TypeListTemplate!M91","v":0},{"$f":"TypeListTemplate!N91","v":0},{"$f":"TypeListTemplate!O91","v":0},{"$f":"TypeListTemplate!P91","v":0},{"$f":"TypeListTemplate!Q91","v":0}]
[{"$f":"TypeListTemplate!A92","v":0},{"$f":"TypeListTemplate!B92","v":0},{"$f":"TypeListTemplate!C92","v":0},{"$f":"TypeListTemplate!D92","v":0},{"$f":"TypeListTemplate!E92","v":0},{"$f":"TypeListTemplate!F92","v":0},{"$f":"TypeListTemplate!G92","v":0},{"$f":"TypeListTemplate!H92","v":0},{"$f":"TypeListTemplate!I92","v":0},{"$f":"TypeListTemplate!J92","v":0},{"$f":"TypeListTemplate!K92","v":0},{"$f":"TypeListTemplate!L92","v":0},{"$f":"TypeListTemplate!M92","v":0},{"$f":"TypeListTemplate!N92","v":0},{"$f":"TypeListTemplate!O92","v":0},{"$f":"TypeListTemplate!P92","v":0},{"$f":"TypeListTemplate!Q92","v":0}]
[{"$f":"TypeListTemplate!A93","v":0},{"$f":"TypeListTemplate!B93","v":0},{"$f":"TypeListTemplate!C93","v":0},{"$f":"TypeListTemplate!D93","v":0},{"$f":"TypeListTemplate!E93","v":0},{"$f":"TypeListTemplate!F93","v":0},{"$f":"TypeListTemplate!G93","v":0},{"$f":"TypeListTemplate!H93","v":0},{"$f":"TypeListTemplate!I93","v":0},{"$f":"TypeListTemplate!J93","v":0},{"$f":"TypeListTemplate!K93","v":0},{"$f":"TypeListTemplate!L93","v":0},{"$f":"TypeListTemplate!M93","v":0},{"$f":"TypeListTemplate!N93","v":0},{"$f":"TypeListTemplate!O93","v":0},{"$f":"TypeListTemplate!P93","v":0},{"$f":"TypeListTemplate!Q93","v":0}]
[{"$f":"TypeListTemplate!A94","v":0},{"$f":"TypeListTemplate!B94","v":0},{"$f":"TypeListTemplate!C94","v":0},{"$f":"TypeListTemplate!D94","v":0},{"$f":"TypeListTemplate!E94","v":0},{"$f":"TypeListTemplate!F94","v":0},{"$f":"TypeListTemplate!G94","v":0},{"$f":"TypeListTemplate!H94","v":0},{"$f":"TypeListTemplate!I94","v":0},{"$f":"TypeListTemplate!J94","v":0},{"$f":"TypeListTemplate!K94","v":0},{"$f":"TypeListTemplate!L94","v":0},{"$f":"TypeListTemplate!M94","v":0},{"$f":"TypeListTemplate!N94","v":0},{"$f":"TypeListTemplate!O94","v":0},{"$f":"TypeListTemplate!P94","v":0},{"$f":"TypeListTemplate!Q94","v":0}]
[{"$f":"TypeListTemplate!A95","v":0},{"$f":"TypeListTemplate!B95","v":0},{"$f":"TypeListTemplate!C95","v":0},{"$f":"TypeListTemplate!D95","v":0},{"$f":"TypeListTemplate!E95","v":0},{"$f":"TypeListTemplate!F95","v":0},{"$f":"TypeListTemplate!G95","v":0},{"$f":"TypeListTemplate!H95","v":0},{"$f":"TypeListTemplate!I95","v":0},{"$f":"TypeListTemplate!J95","v":0},{"$f":"TypeListTemplate!K95","v":0},{"$f":"TypeListTemplate!L95","v":0},{"$f":"TypeListTemplate!M95","v":0},{"$f":"TypeListTemplate!N95","v":0},{"$f":"TypeListTemplate!O95","v":0},{"$f":"TypeListTemplate!P95","v":0},{"$f":"TypeListTemplate!Q95","v":0}]

{"sheet":"ACS550","index":2,"n_rows":95,"n_cols":17,"rows_kept":95,"cut":false,"hidden":true,"merged":[]}
["Typecode","Prod.class",null,"Voltage range 1",null,"Voltage range 2 (1-ph)",null,"Voltage range 2",null,"Voltage range 3",null,"Voltage range 4.6",null,"Voltage range 5",null,"Voltage range 7/6"]
[{"$f":"VLOOKUP(DriveSel!E20,C8:Y71,DriveSel!D18)","v":"ACS550-01-246A-4"},{"$f":"VLOOKUP(#REF!,C8:X70,7)","v":{"$error":"#REF!"}},"non-US (50Hz)"," 115 V (1-ph)",null," 230 V (1-ph)",null," 230 V (3-ph)",null," 400 V",null," 460 V",null," 500 V",null," 690 V"]
["Col.ordinal","Col.ordinal"]
[null,null,"Alternatives:","115 V 1-ph",null,"200/208/230/240 V 1-ph",null,"200/208/230/240 V 3-ph",null,"380/400/415 V",null,"440/460/480 V",null,"500 V",null,"525/550/575/600/660/690 V"]
["Motor Power","Motor",null,"Drive type",null,"Drive type",null,"Drive type",null,"Drive type",null,"Drive type",null,"Drive type",null,"Drive type"]
[{"$f":"TypeListTemplate!A6","v":"Hp"},{"$f":"TypeListTemplate!B6","v":"power kW"}]
[{"$f":"TypeListTemplate!A7","v":0},{"$f":"TypeListTemplate!B7","v":"Column Ordinal ->"},{"$f":"TypeListTemplate!C7","v":1},{"$f":"TypeListTemplate!D7","v":2},{"$f":"TypeListTemplate!E7","v":3},{"$f":"TypeListTemplate!F7","v":4},{"$f":"TypeListTemplate!G7","v":5},{"$f":"TypeListTemplate!H7","v":6},{"$f":"TypeListTemplate!I7","v":7},{"$f":"TypeListTemplate!J7","v":8},{"$f":"TypeListTemplate!K7","v":9},{"$f":"TypeListTemplate!L7","v":10},{"$f":"TypeListTemplate!M7","v":11},{"$f":"TypeListTemplate!N7","v":12},{"$f":"TypeListTemplate!O7","v":13},{"$f":"TypeListTemplate!P7","v":14},{"$f":"TypeListTemplate!Q7","v":15}]
[{"$f":"TypeListTemplate!A8","v":0},{"$f":"TypeListTemplate!B8","v":0},{"$f":"TypeListTemplate!C8","v":0}]
[{"$f":"TypeListTemplate!A9","v":7.3756202226096287E-2},{"$f":"TypeListTemplate!B9","v":5.5E-2},{"$f":"TypeListTemplate!C9","v":0.01}]
[{"$f":"TypeListTemplate!A10","v":0.12069196727906664},{"$f":"TypeListTemplate!B10","v":0.09},{"$f":"TypeListTemplate!C10","v":6.5000000000000002E-2}]
[{"$f":"TypeListTemplate!A11","v":0.16092262303875551},{"$f":"TypeListTemplate!B11","v":0.12},{"$f":"TypeListTemplate!C11","v":9.9999999999999992E-2}]
[{"$f":"TypeListTemplate!A12","v":0.24138393455813328},{"$f":"TypeListTemplate!B12","v":0.18},{"$f":"TypeListTemplate!C12","v":0.13}]
[{"$f":"TypeListTemplate!A13","v":0.49617808770282951},{"$f":"TypeListTemplate!B13","v":0.37},{"$f":"TypeListTemplate!C13","v":0.19}]
[{"$f":"TypeListTemplate!A14","v":0.7375620222609629},{"$f":"TypeListTemplate!B14","v":0.55000000000000004},{"$f":"TypeListTemplate!C14","v":0.38},null,null,null,null,"ACS550-01-04A6-2"]
[{"$f":"TypeListTemplate!A15","v":1.0057663939922221},{"$f":"TypeListTemplate!B15","v":0.75},{"$f":"TypeListTemplate!C15","v":0.56000000000000005},null,null,null,null,"ACS550-01-04A6-2",null,"ACS550-01-03A3-4",null,"ACS550-01-03A3-4"]
[{"$f":"TypeListTemplate!A16","v":1.4751240445219258},{"$f":"TypeListTemplate!B16","v":1.1000000000000001},{"$f":"TypeListTemplate!C16","v":0.76},null,null,null,null,"ACS550-01-06A6-2",null,"ACS550-01-03A3-4",null,"ACS550-01-03A3-4"]
[{"$f":"TypeListTemplate!A17","v":2.0115327879844442},{"$f":"TypeListTemplate!B17","v":1.5},{"$f":"TypeListTemplate!C17","v":1.1100000000000001},null,null,null,null,"ACS550-01-07A5-2",null,"ACS550-01-04A1-4",null,"ACS550-01-04A1-4"]
[{"$f":"TypeListTemplate!A18","v":2.9502480890438516},{"$f":"TypeListTemplate!B18","v":2.2000000000000002},{"$f":"TypeListTemplate!C18","v":1.51},null,null,null,null,"ACS550-01-012A-2",null,"ACS550-01-05A4-4",null,"ACS550-01-05A4-4"]
[{"$f":"TypeListTemplate!A19","v":4.0230655759688885},{"$f":"TypeListTemplate!B19","v":3},{"$f":"TypeListTemplate!C19","v":2.21},null,null,null,null,"ACS550-01-017A-2",null,"ACS550-01-06A9-4",null,"ACS550-01-06A9-4"]
[{"$f":"TypeListTemplate!A20","v":5},{"$f":"TypeListTemplate!B20","v":3.7285000000000004},{"$f":"TypeListTemplate!C20","v":3.01},null,null,null,null,"ACS550-01-017A-2",null,"ACS550-01-08A8-4",null,"ACS550-01-06A9-4"]
[{"$f":"TypeListTemplate!A21","v":5.3640874346251843},{"$f":"TypeListTemplate!B21","v":4},{"$f":"TypeListTemplate!C21","v":3.7385000000000002},null,null,null,null,"ACS550-01-017A-2",null,"ACS550-01-08A8-4",null,"ACS550-01-08A8-4"]
[{"$f":"TypeListTemplate!A22","v":7.3756202226096281},{"$f":"TypeListTemplate!B22","v":5.5},{"$f":"TypeListTemplate!C22","v":4.01},null,null,null,null,"ACS550-01-024A-2",null,"ACS550-01-012A-4",null,"ACS550-01-012A-4"]
[{"$f":"TypeListTemplate!A23","v":10.05766393992222},{"$f":"TypeListTemplate!B23","v":7.5},{"$f":"TypeListTemplate!C23","v":5.51},null,null,null,null,"ACS550-01-031A-2",null,"ACS550-01-015A-4",null,"ACS550-01-015A-4"]
[{"$f":"TypeListTemplate!A24","v":14.751240445219256},{"$f":"TypeListTemplate!B24","v":11},{"$f":"TypeListTemplate!C24","v":7.51},null,null,null,null,"ACS550-01-046A-2",null,"ACS550-01-023A-4",null,"ACS550-01-023A-4"]
[{"$f":"TypeListTemplate!A25","v":20.11532787984444},{"$f":"TypeListTemplate!B25","v":15},{"$f":"TypeListTemplate!C25","v":11.01},null,null,null,null,"ACS550-01-059A-2",null,"ACS550-01-031A-4",null,"ACS550-01-031A-4"]
[{"$f":"TypeListTemplate!A26","v":24.808904385141478},{"$f":"TypeListTemplate!B26","v":18.5},{"$f":"TypeListTemplate!C26","v":15.01},null,null,null,null,"ACS550-01-075A-2",null,"ACS550-01-038A-4",null,"ACS550-01-038A-4"]
[{"$f":"TypeListTemplate!A27","v":29.502480890438513},{"$f":"TypeListTemplate!B27","v":22},{"$f":"TypeListTemplate!C27","v":18.510000000000002},null,null,null,null,"ACS550-01-088A-2",null,"ACS550-01-045A-4",null,"ACS550-01-045A-4"]
[{"$f":"TypeListTemplate!A28","v":40.230655759688879},{"$f":"TypeListTemplate!B28","v":30},{"$f":"TypeListTemplate!C28","v":22.01},null,null,null,null,"ACS550-01-114A-2",null,"ACS550-01-059A-4",null,"ACS550-01-059A-4"]
[{"$f":"TypeListTemplate!A29","v":49.617808770282956},{"$f":"TypeListTemplate!B29","v":37},{"$f":"TypeListTemplate!C29","v":30.01},null,null,null,null,"ACS550-01-143A-2",null,"ACS550-01-072A-4",null,"ACS550-01-072A-4"]
[{"$f":"TypeListTemplate!A30","v":60.345983639533323},{"$f":"TypeListTemplate!B30","v":45},{"$f":"TypeListTemplate!C30","v":37.01},null,null,null,null,"ACS550-01-178A-2",null,"ACS550-01-087A-4",null,"ACS550-01-087A-4"]
[{"$f":"TypeListTemplate!A31","v":73.756202226096278},{"$f":"TypeListTemplate!B31","v":55},{"$f":"TypeListTemplate!C31","v":45.01},null,null,null,null,"ACS550-01-221A-2",null,"ACS550-01-125A-4",null,"ACS550-01-087A-4"]
[{"$f":"TypeListTemplate!A32","v":100.5766393992222},{"$f":"TypeListTemplate!B32","v":75},{"$f":"TypeListTemplate!C32","v":55.01},null,null,null,null,"ACS550-01-248A-2",null,"ACS550-01-157A-4",null,"ACS550-01-125A-4"]
[{"$f":"TypeListTemplate!A33","v":120.69196727906665},{"$f":"TypeListTemplate!B33","v":90},{"$f":"TypeListTemplate!C33","v":75.010000000000005},null,null,null,null,null,null,"ACS550-01-180A-4",null,"ACS550-01-157A-4"]
[{"$f":"TypeListTemplate!A34","v":147.51240445219256},{"$f":"TypeListTemplate!B34","v":110},{"$f":"TypeListTemplate!C34","v":90.01},null,null,null,null,null,null,"ACS550-01-195A-4",null,"ACS550-01-180A-4"]
[{"$f":"TypeListTemplate!A35","v":177.01488534263109},{"$f":"TypeListTemplate!B35","v":132},{"$f":"TypeListTemplate!C35","v":110.01},null,null,null,null,null,null,"ACS550-01-246A-4",null,"ACS550-01-246A-4"]
[{"$f":"TypeListTemplate!A36","v":200},{"$f":"TypeListTemplate!B36","v":149.14000000000001},{"$f":"TypeListTemplate!C36","v":132.01},null,null,null,null,null,null,"ACS550-02-290A-4",null,"ACS550-01-246A-4"]
[{"$f":"TypeListTemplate!A37","v":214.56349738500737},{"$f":"TypeListTemplate!B37","v":160},{"$f":"TypeListTemplate!C37","v":149.15},null,null,null,null,null,null,"ACS550-02-290A-4",null,"ACS550-02-290A-4"]
[{"$f":"TypeListTemplate!A38","v":250},{"$f":"TypeListTemplate!B38","v":186.42500000000001},{"$f":"TypeListTemplate!C38","v":160.01},null,null,null,null,null,null,"ACS550-02-368A-4",null,"ACS550-02-368A-4"]
[{"$f":"TypeListTemplate!A39","v":268.20437173125919},{"$f":"TypeListTemplate!B39","v":200},{"$f":"TypeListTemplate!C39","v":186.435},null,null,null,null,null,null,"ACS550-02-368A-4",null,"ACS550-02-368A-4"]
[{"$f":"TypeListTemplate!A40","v":300},{"$f":"TypeListTemplate!B40","v":223.71},{"$f":"TypeListTemplate!C40","v":200.01},null,null,null,null,null,null,"ACS550-02-486A-4",null,"ACS550-02-368A-4"]
[{"$f":"TypeListTemplate!A41","v":335.255464664074},{"$f":"TypeListTemplate!B41","v":250},{"$f":"TypeListTemplate!C41","v":223.72},null,null,null,null,null,null,"ACS550-02-526A-4",null,"ACS550-02-486A-4"]
[{"$f":"TypeListTemplate!A42","v":400},{"$f":"TypeListTemplate!B42","v":298.28000000000003},{"$f":"TypeListTemplate!C42","v":250.01},null,null,null,null,null,null,"ACS550-02-602A-4",null,"ACS550-02-486A-4"]
[{"$f":"TypeListTemplate!A43","v":422.42188547673328},{"$f":"TypeListTemplate!B43","v":315},{"$f":"TypeListTemplate!C43","v":298.29000000000002},null,null,null,null,null,null,"ACS550-02-602A-4",null,"ACS550-02-602A-4"]
[{"$f":"TypeListTemplate!A44","v":476.06275982298507},{"$f":"TypeListTemplate!B44","v":355},{"$f":"TypeListTemplate!C44","v":315.01},null,null,null,null,null,null,"ACS550-02-645A-4",null,"ACS550-02-602A-4"]
[{"$f":"TypeListTemplate!A45","v":536.40874346251837},{"$f":"TypeListTemplate!B45","v":400},{"$f":"TypeListTemplate!C45","v":355.01},null,null,null,null,null,null,null,null,"ACS550-02-645A-4"]
[{"$f":"TypeListTemplate!A46","v":603.45983639533324},{"$f":"TypeListTemplate!B46","v":450},{"$f":"TypeListTemplate!C46","v":400.01}]
[{"$f":"TypeListTemplate!A47","v":670.51092932814799},{"$f":"TypeListTemplate!B47","v":500},{"$f":"TypeListTemplate!C47","v":450.01}]
[{"$f":"TypeListTemplate!A48","v":750.97224084752577},{"$f":"TypeListTemplate!B48","v":560},{"$f":"TypeListTemplate!C48","v":500.01}]
[{"$f":"TypeListTemplate!A49","v":844.84377095346656},{"$f":"TypeListTemplate!B49","v":630},{"$f":"TypeListTemplate!C49","v":560.01}]
[{"$f":"TypeListTemplate!A50","v":952.12551964597014},{"$f":"TypeListTemplate!B50","v":710},{"$f":"TypeListTemplate!C50","v":630.01}]
[{"$f":"TypeListTemplate!A51","v":1072.8174869250367},{"$f":"TypeListTemplate!B51","v":800},{"$f":"TypeListTemplate!C51","v":710.01}]
[{"$f":"TypeListTemplate!A52","v":1206.9196727906665},{"$f":"TypeListTemplate!B52","v":900},{"$f":"TypeListTemplate!C52","v":800.01}]
[{"$f":"TypeListTemplate!A53","v":1341.021858656296},{"$f":"TypeListTemplate!B53","v":1000},{"$f":"TypeListTemplate!C53","v":900.01}]
[{"$f":"TypeListTemplate!A54","v":1501.9444816950515},{"$f":"TypeListTemplate!B54","v":1120},{"$f":"TypeListTemplate!C54","v":1000.01}]
[{"$f":"TypeListTemplate!A55","v":1676.27732332037},{"$f":"TypeListTemplate!B55","v":1250},{"$f":"TypeListTemplate!C55","v":1120.01}]
[{"$f":"TypeListTemplate!A56","v":1877.4306021188145},{"$f":"TypeListTemplate!B56","v":1400},{"$f":"TypeListTemplate!C56","v":1250.01}]
[{"$f":"TypeListTemplate!A57","v":2145.6349738500735},{"$f":"TypeListTemplate!B57","v":1600},{"$f":"TypeListTemplate!C57","v":1400.01}]
[{"$f":"TypeListTemplate!A58","v":2346.7882526485182},{"$f":"TypeListTemplate!B58","v":1750},{"$f":"TypeListTemplate!C58","v":1600.01}]
[{"$f":"TypeListTemplate!A59","v":2413.839345581333},{"$f":"TypeListTemplate!B59","v":1800},{"$f":"TypeListTemplate!C59","v":1750.01}]
[{"$f":"TypeListTemplate!A60","v":2682.043717312592},{"$f":"TypeListTemplate!B60","v":2000},{"$f":"TypeListTemplate!C60","v":1800.01}]
[{"$f":"TypeListTemplate!A61","v":2950.2480890438515},{"$f":"TypeListTemplate!B61","v":2200},{"$f":"TypeListTemplate!C61","v":2000.01}]
[{"$f":"TypeListTemplate!A62","v":3017.2991819766662},{"$f":"TypeListTemplate!B62","v":2250},{"$f":"TypeListTemplate!C62","v":2200.0100000000002}]
[{"$f":"TypeListTemplate!A63","v":3084.350274909481},{"$f":"TypeListTemplate!B63","v":2300},{"$f":"TypeListTemplate!C63","v":2250.0100000000002}]
[{"$f":"TypeListTemplate!A64","v":3352.55464664074},{"$f":"TypeListTemplate!B64","v":2500},{"$f":"TypeListTemplate!C64","v":2300.0100000000002}]
[{"$f":"TypeListTemplate!A65","v":3754.861204237629},{"$f":"TypeListTemplate!B65","v":2800},{"$f":"TypeListTemplate!C65","v":2500.0100000000002}]
[{"$f":"TypeListTemplate!A66","v":4224.2188547673322},{"$f":"TypeListTemplate!B66","v":3150},{"$f":"TypeListTemplate!C66","v":2800.01}]
[{"$f":"TypeListTemplate!A67","v":4760.6275982298512},{"$f":"TypeListTemplate!B67","v":3550},{"$f":"TypeListTemplate!C67","v":3150.01}]
[{"$f":"TypeListTemplate!A68","v":5364.087434625184},{"$f":"TypeListTemplate!B68","v":4000},{"$f":"TypeListTemplate!C68","v":3550.01}]
[{"$f":"TypeListTemplate!A69","v":6034.5983639533324},{"$f":"TypeListTemplate!B69","v":4500},{"$f":"TypeListTemplate!C69","v":4000.01}]
[{"$f":"TypeListTemplate!A70","v":6705.1092932814799},{"$f":"TypeListTemplate!B70","v":5000},{"$f":"TypeListTemplate!C70","v":4500.01}]
[{"$f":"TypeListTemplate!A71","v":0},{"$f":"TypeListTemplate!B71","v":999999999},{"$f":"TypeListTemplate!C71","v":5000.01}]
[{"$f":"TypeListTemplate!A72","v":0},{"$f":"TypeListTemplate!B72","v":0},{"$f":"TypeListTemplate!C72","v":0}]
[{"$f":"TypeListTemplate!A73","v":0},{"$f":"TypeListTemplate!B73","v":0},{"$f":"TypeListTemplate!C73","v":0},{"$f":"TypeListTemplate!D73","v":"Drive type"},{"$f":"TypeListTemplate!E73","v":0},{"$f":"TypeListTemplate!F73","v":"Drive type"},{"$f":"TypeListTemplate!G73","v":0},{"$f":"TypeListTemplate!H73","v":"Drive type"},{"$f":"TypeListTemplate!I73","v":0},{"$f":"TypeListTemplate!J73","v":"Drive type"},{"$f":"TypeListTemplate!K73","v":0},{"$f":"TypeListTemplate!L73","v":"Drive type"},{"$f":"TypeListTemplate!M73","v":0},{"$f":"TypeListTemplate!N73","v":"Drive type"},{"$f":"TypeListTemplate!O73","v":0},{"$f":"TypeListTemplate!P73","v":"Drive type"},{"$f":"TypeListTemplate!Q73","v":0}]
[{"$f":"TypeListTemplate!A74","v":0},{"$f":"TypeListTemplate!B74","v":0},{"$f":"TypeListTemplate!C74","v":0},{"$f":"TypeListTemplate!D74","v":" 115 V (1-ph)"},{"$f":"TypeListTemplate!E74","v":0},{"$f":"TypeListTemplate!F74","v":" 230 V (1-ph)"},{"$f":"TypeListTemplate!G74","v":0},{"$f":"TypeListTemplate!H74","v":" 230 V (3-ph)"},{"$f":"TypeListTemplate!I74","v":0},{"$f":"TypeListTemplate!J74","v":" 400 V"},{"$f":"TypeListTemplate!K74","v":0},{"$f":"TypeListTemplate!L74","v":" 460 V"},{"$f":"TypeListTemplate!M74","v":0},{"$f":"TypeListTemplate!N74","v":" 500 V"},{"$f":"TypeListTemplate!O74","v":0},{"$f":"TypeListTemplate!P74","v":" 690 V"},{"$f":"TypeListTemplate!Q74","v":0}]
[{"$f":"TypeListTemplate!A75","v":0},{"$f":"TypeListTemplate!B75","v":0},{"$f":"TypeListTemplate!C75","v":0},{"$f":"TypeListTemplate!D75","v":0},{"$f":"TypeListTemplate!E75","v":0},{"$f":"TypeListTemplate!F75","v":0},{"$f":"TypeListTemplate!G75","v":0},{"$f":"TypeListTemplate!H75","v":0},{"$f":"TypeListTemplate!I75","v":0},{"$f":"TypeListTemplate!J75","v":0},{"$f":"TypeListTemplate!K75","v":0},{"$f":"TypeListTemplate!L75","v":0},{"$f":"TypeListTemplate!M75","v":0},{"$f":"TypeListTemplate!N75","v":0},{"$f":"TypeListTemplate!O75","v":0},{"$f":"TypeListTemplate!P75","v":0},{"$f":"TypeListTemplate!Q75","v":0}]
[{"$f":"TypeListTemplate!A76","v":0},{"$f":"TypeListTemplate!B76","v":0},{"$f":"TypeListTemplate!C76","v":0},{"$f":"TypeListTemplate!D76","v":0},{"$f":"TypeListTemplate!E76","v":0},{"$f":"TypeListTemplate!F76","v":0},{"$f":"TypeListTemplate!G76","v":0},{"$f":"TypeListTemplate!H76","v":0},{"$f":"TypeListTemplate!I76","v":0},{"$f":"TypeListTemplate!J76","v":0},{"$f":"TypeListTemplate!K76","v":0},{"$f":"TypeListTemplate!L76","v":0},{"$f":"TypeListTemplate!M76","v":0},{"$f":"TypeListTemplate!N76","v":0},{"$f":"TypeListTemplate!O76","v":0},{"$f":"TypeListTemplate!P76","v":0},{"$f":"TypeListTemplate!Q76","v":0}]
[{"$f":"TypeListTemplate!A77","v":0},{"$f":"TypeListTemplate!B77","v":0},{"$f":"TypeListTemplate!C77","v":0},{"$f":"TypeListTemplate!D77","v":0},{"$f":"TypeListTemplate!E77","v":0},{"$f":"TypeListTemplate!F77","v":0},{"$f":"TypeListTemplate!G77","v":0},{"$f":"TypeListTemplate!H77","v":0},{"$f":"TypeListTemplate!I77","v":0},{"$f":"TypeListTemplate!J77","v":0},{"$f":"TypeListTemplate!K77","v":0},{"$f":"TypeListTemplate!L77","v":0},{"$f":"TypeListTemplate!M77","v":0},{"$f":"TypeListTemplate!N77","v":0},{"$f":"TypeListTemplate!O77","v":0},{"$f":"TypeListTemplate!P77","v":0},{"$f":"TypeListTemplate!Q77","v":0}]
[{"$f":"TypeListTemplate!A78","v":0},{"$f":"TypeListTemplate!B78","v":0},{"$f":"TypeListTemplate!C78","v":0},{"$f":"TypeListTemplate!D78","v":0},{"$f":"TypeListTemplate!E78","v":0},{"$f":"TypeListTemplate!F78","v":0},{"$f":"TypeListTemplate!G78","v":0},{"$f":"TypeListTemplate!H78","v":0},{"$f":"TypeListTemplate!I78","v":0},{"$f":"TypeListTemplate!J78","v":0},{"$f":"TypeListTemplate!K78","v":0},{"$f":"TypeListTemplate!L78","v":0},{"$f":"TypeListTemplate!M78","v":0},{"$f":"TypeListTemplate!N78","v":0},{"$f":"TypeListTemplate!O78","v":0},{"$f":"TypeListTemplate!P78","v":0},{"$f":"TypeListTemplate!Q78","v":0}]
[{"$f":"TypeListTemplate!A79","v":0},{"$f":"TypeListTemplate!B79","v":0},{"$f":"TypeListTemplate!C79","v":0},{"$f":"TypeListTemplate!D79","v":0},{"$f":"TypeListTemplate!E79","v":0},{"$f":"TypeListTemplate!F79","v":0},{"$f":"TypeListTemplate!G79","v":0},{"$f":"TypeListTemplate!H79","v":0},{"$f":"TypeListTemplate!I79","v":0},{"$f":"TypeListTemplate!J79","v":0},{"$f":"TypeListTemplate!K79","v":0},{"$f":"TypeListTemplate!L79","v":0},{"$f":"TypeListTemplate!M79","v":0},{"$f":"TypeListTemplate!N79","v":0},{"$f":"TypeListTemplate!O79","v":0},{"$f":"TypeListTemplate!P79","v":0},{"$f":"TypeListTemplate!Q79","v":0}]
[{"$f":"TypeListTemplate!A80","v":0},{"$f":"TypeListTemplate!B80","v":0},{"$f":"TypeListTemplate!C80","v":0},{"$f":"TypeListTemplate!D80","v":0},{"$f":"TypeListTemplate!E80","v":0},{"$f":"TypeListTemplate!F80","v":0},{"$f":"TypeListTemplate!G80","v":0},{"$f":"TypeListTemplate!H80","v":0},{"$f":"TypeListTemplate!I80","v":0},{"$f":"TypeListTemplate!J80","v":0},{"$f":"TypeListTemplate!K80","v":0},{"$f":"TypeListTemplate!L80","v":0},{"$f":"TypeListTemplate!M80","v":0},{"$f":"TypeListTemplate!N80","v":0},{"$f":"TypeListTemplate!O80","v":0},{"$f":"TypeListTemplate!P80","v":0},{"$f":"TypeListTemplate!Q80","v":0}]
[{"$f":"TypeListTemplate!A81","v":0},{"$f":"TypeListTemplate!B81","v":0},{"$f":"TypeListTemplate!C81","v":0},{"$f":"TypeListTemplate!D81","v":0},{"$f":"TypeListTemplate!E81","v":0},{"$f":"TypeListTemplate!F81","v":0},{"$f":"TypeListTemplate!G81","v":0},{"$f":"TypeListTemplate!H81","v":0},{"$f":"TypeListTemplate!I81","v":0},{"$f":"TypeListTemplate!J81","v":0},{"$f":"TypeListTemplate!K81","v":0},{"$f":"TypeListTemplate!L81","v":0},{"$f":"TypeListTemplate!M81","v":0},{"$f":"TypeListTemplate!N81","v":0},{"$f":"TypeListTemplate!O81","v":0},{"$f":"TypeListTemplate!P81","v":0},{"$f":"TypeListTemplate!Q81","v":0}]
[{"$f":"TypeListTemplate!A82","v":0},{"$f":"TypeListTemplate!B82","v":0},{"$f":"TypeListTemplate!C82","v":0},{"$f":"TypeListTemplate!D82","v":0},{"$f":"TypeListTemplate!E82","v":0},{"$f":"TypeListTemplate!F82","v":0},{"$f":"TypeListTemplate!G82","v":0},{"$f":"TypeListTemplate!H82","v":0},{"$f":"TypeListTemplate!I82","v":0},{"$f":"TypeListTemplate!J82","v":0},{"$f":"TypeListTemplate!K82","v":0},{"$f":"TypeListTemplate!L82","v":0},{"$f":"TypeListTemplate!M82","v":0},{"$f":"TypeListTemplate!N82","v":0},{"$f":"TypeListTemplate!O82","v":0},{"$f":"TypeListTemplate!P82","v":0},{"$f":"TypeListTemplate!Q82","v":0}]
[{"$f":"TypeListTemplate!A83","v":0},{"$f":"TypeListTemplate!B83","v":0},{"$f":"TypeListTemplate!C83","v":0},{"$f":"TypeListTemplate!D83","v":0},{"$f":"TypeListTemplate!E83","v":0},{"$f":"TypeListTemplate!F83","v":0},{"$f":"TypeListTemplate!G83","v":0},{"$f":"TypeListTemplate!H83","v":0},{"$f":"TypeListTemplate!I83","v":0},{"$f":"TypeListTemplate!J83","v":0},{"$f":"TypeListTemplate!K83","v":0},{"$f":"TypeListTemplate!L83","v":0},{"$f":"TypeListTemplate!M83","v":0},{"$f":"TypeListTemplate!N83","v":0},{"$f":"TypeListTemplate!O83","v":0},{"$f":"TypeListTemplate!P83","v":0},{"$f":"TypeListTemplate!Q83","v":0}]
[{"$f":"TypeListTemplate!A84","v":0},{"$f":"TypeListTemplate!B84","v":0},{"$f":"TypeListTemplate!C84","v":0},{"$f":"TypeListTemplate!D84","v":0},{"$f":"TypeListTemplate!E84","v":0},{"$f":"TypeListTemplate!F84","v":0},{"$f":"TypeListTemplate!G84","v":0},{"$f":"TypeListTemplate!H84","v":0},{"$f":"TypeListTemplate!I84","v":0},{"$f":"TypeListTemplate!J84","v":0},{"$f":"TypeListTemplate!K84","v":0},{"$f":"TypeListTemplate!L84","v":0},{"$f":"TypeListTemplate!M84","v":0},{"$f":"TypeListTemplate!N84","v":0},{"$f":"TypeListTemplate!O84","v":0},{"$f":"TypeListTemplate!P84","v":0},{"$f":"TypeListTemplate!Q84","v":0}]
[{"$f":"TypeListTemplate!A85","v":0},{"$f":"TypeListTemplate!B85","v":0},{"$f":"TypeListTemplate!C85","v":0},{"$f":"TypeListTemplate!D85","v":0},{"$f":"TypeListTemplate!E85","v":0},{"$f":"TypeListTemplate!F85","v":0},{"$f":"TypeListTemplate!G85","v":0},{"$f":"TypeListTemplate!H85","v":0},{"$f":"TypeListTemplate!I85","v":0},{"$f":"TypeListTemplate!J85","v":0},{"$f":"TypeListTemplate!K85","v":0},{"$f":"TypeListTemplate!L85","v":0},{"$f":"TypeListTemplate!M85","v":0},{"$f":"TypeListTemplate!N85","v":0},{"$f":"TypeListTemplate!O85","v":0},{"$f":"TypeListTemplate!P85","v":0},{"$f":"TypeListTemplate!Q85","v":0}]
[{"$f":"TypeListTemplate!A86","v":0},{"$f":"TypeListTemplate!B86","v":0},{"$f":"TypeListTemplate!C86","v":0},{"$f":"TypeListTemplate!D86","v":0},{"$f":"TypeListTemplate!E86","v":0},{"$f":"TypeListTemplate!F86","v":0},{"$f":"TypeListTemplate!G86","v":0},{"$f":"TypeListTemplate!H86","v":0},{"$f":"TypeListTemplate!I86","v":0},{"$f":"TypeListTemplate!J86","v":0},{"$f":"TypeListTemplate!K86","v":0},{"$f":"TypeListTemplate!L86","v":0},{"$f":"TypeListTemplate!M86","v":0},{"$f":"TypeListTemplate!N86","v":0},{"$f":"TypeListTemplate!O86","v":0},{"$f":"TypeListTemplate!P86","v":0},{"$f":"TypeListTemplate!Q86","v":0}]
[{"$f":"TypeListTemplate!A87","v":0},{"$f":"TypeListTemplate!B87","v":0},{"$f":"TypeListTemplate!C87","v":0},{"$f":"TypeListTemplate!D87","v":0},{"$f":"TypeListTemplate!E87","v":0},{"$f":"TypeListTemplate!F87","v":0},{"$f":"TypeListTemplate!G87","v":0},{"$f":"TypeListTemplate!H87","v":0},{"$f":"TypeListTemplate!I87","v":0},{"$f":"TypeListTemplate!J87","v":0},{"$f":"TypeListTemplate!K87","v":0},{"$f":"TypeListTemplate!L87","v":0},{"$f":"TypeListTemplate!M87","v":0},{"$f":"TypeListTemplate!N87","v":0},{"$f":"TypeListTemplate!O87","v":0},{"$f":"TypeListTemplate!P87","v":0},{"$f":"TypeListTemplate!Q87","v":0}]
[{"$f":"TypeListTemplate!A88","v":0},{"$f":"TypeListTemplate!B88","v":0},{"$f":"TypeListTemplate!C88","v":0},{"$f":"TypeListTemplate!D88","v":0},{"$f":"TypeListTemplate!E88","v":0},{"$f":"TypeListTemplate!F88","v":0},{"$f":"TypeListTemplate!G88","v":0},{"$f":"TypeListTemplate!H88","v":0},{"$f":"TypeListTemplate!I88","v":0},{"$f":"TypeListTemplate!J88","v":0},{"$f":"TypeListTemplate!K88","v":0},{"$f":"TypeListTemplate!L88","v":0},{"$f":"TypeListTemplate!M88","v":0},{"$f":"TypeListTemplate!N88","v":0},{"$f":"TypeListTemplate!O88","v":0},{"$f":"TypeListTemplate!P88","v":0},{"$f":"TypeListTemplate!Q88","v":0}]
[{"$f":"TypeListTemplate!A89","v":0},{"$f":"TypeListTemplate!B89","v":0},{"$f":"TypeListTemplate!C89","v":0},{"$f":"TypeListTemplate!D89","v":0},{"$f":"TypeListTemplate!E89","v":0},{"$f":"TypeListTemplate!F89","v":0},{"$f":"TypeListTemplate!G89","v":0},{"$f":"TypeListTemplate!H89","v":0},{"$f":"TypeListTemplate!I89","v":0},{"$f":"TypeListTemplate!J89","v":0},{"$f":"TypeListTemplate!K89","v":0},{"$f":"TypeListTemplate!L89","v":0},{"$f":"TypeListTemplate!M89","v":0},{"$f":"TypeListTemplate!N89","v":0},{"$f":"TypeListTemplate!O89","v":0},{"$f":"TypeListTemplate!P89","v":0},{"$f":"TypeListTemplate!Q89","v":0}]
[{"$f":"TypeListTemplate!A90","v":0},{"$f":"TypeListTemplate!B90","v":0},{"$f":"TypeListTemplate!C90","v":0},{"$f":"TypeListTemplate!D90","v":0},{"$f":"TypeListTemplate!E90","v":0},{"$f":"TypeListTemplate!F90","v":0},{"$f":"TypeListTemplate!G90","v":0},{"$f":"TypeListTemplate!H90","v":0},{"$f":"TypeListTemplate!I90","v":0},{"$f":"TypeListTemplate!J90","v":0},{"$f":"TypeListTemplate!K90","v":0},{"$f":"TypeListTemplate!L90","v":0},{"$f":"TypeListTemplate!M90","v":0},{"$f":"TypeListTemplate!N90","v":0},{"$f":"TypeListTemplate!O90","v":0},{"$f":"TypeListTemplate!P90","v":0},{"$f":"TypeListTemplate!Q90","v":0}]
[{"$f":"TypeListTemplate!A91","v":0},{"$f":"TypeListTemplate!B91","v":0},{"$f":"TypeListTemplate!C91","v":0},{"$f":"TypeListTemplate!D91","v":0},{"$f":"TypeListTemplate!E91","v":0},{"$f":"TypeListTemplate!F91","v":0},{"$f":"TypeListTemplate!G91","v":0},{"$f":"TypeListTemplate!H91","v":0},{"$f":"TypeListTemplate!I91","v":0},{"$f":"TypeListTemplate!J91","v":0},{"$f":"TypeListTemplate!K91","v":0},{"$f":"TypeListTemplate!L91","v":0},{"$f":"TypeListTemplate!M91","v":0},{"$f":"TypeListTemplate!N91","v":0},{"$f":"TypeListTemplate!O91","v":0},{"$f":"TypeListTemplate!P91","v":0},{"$f":"TypeListTemplate!Q91","v":0}]
[{"$f":"TypeListTemplate!A92","v":0},{"$f":"TypeListTemplate!B92","v":0},{"$f":"TypeListTemplate!C92","v":0},{"$f":"TypeListTemplate!D92","v":0},{"$f":"TypeListTemplate!E92","v":0},{"$f":"TypeListTemplate!F92","v":0},{"$f":"TypeListTemplate!G92","v":0},{"$f":"TypeListTemplate!H92","v":0},{"$f":"TypeListTemplate!I92","v":0},{"$f":"TypeListTemplate!J92","v":0},{"$f":"TypeListTemplate!K92","v":0},{"$f":"TypeListTemplate!L92","v":0},{"$f":"TypeListTemplate!M92","v":0},{"$f":"TypeListTemplate!N92","v":0},{"$f":"TypeListTemplate!O92","v":0},{"$f":"TypeListTemplate!P92","v":0},{"$f":"TypeListTemplate!Q92","v":0}]
[{"$f":"TypeListTemplate!A93","v":0},{"$f":"TypeListTemplate!B93","v":0},{"$f":"TypeListTemplate!C93","v":0},{"$f":"TypeListTemplate!D93","v":0},{"$f":"TypeListTemplate!E93","v":0},{"$f":"TypeListTemplate!F93","v":0},{"$f":"TypeListTemplate!G93","v":0},{"$f":"TypeListTemplate!H93","v":0},{"$f":"TypeListTemplate!I93","v":0},{"$f":"TypeListTemplate!J93","v":0},{"$f":"TypeListTemplate!K93","v":0},{"$f":"TypeListTemplate!L93","v":0},{"$f":"TypeListTemplate!M93","v":0},{"$f":"TypeListTemplate!N93","v":0},{"$f":"TypeListTemplate!O93","v":0},{"$f":"TypeListTemplate!P93","v":0},{"$f":"TypeListTemplate!Q93","v":0}]
[{"$f":"TypeListTemplate!A94","v":0},{"$f":"TypeListTemplate!B94","v":0},{"$f":"TypeListTemplate!C94","v":0},{"$f":"TypeListTemplate!D94","v":0},{"$f":"TypeListTemplate!E94","v":0},{"$f":"TypeListTemplate!F94","v":0},{"$f":"TypeListTemplate!G94","v":0},{"$f":"TypeListTemplate!H94","v":0},{"$f":"TypeListTemplate!I94","v":0},{"$f":"TypeListTemplate!J94","v":0},{"$f":"TypeListTemplate!K94","v":0},{"$f":"TypeListTemplate!L94","v":0},{"$f":"TypeListTemplate!M94","v":0},{"$f":"TypeListTemplate!N94","v":0},{"$f":"TypeListTemplate!O94","v":0},{"$f":"TypeListTemplate!P94","v":0},{"$f":"TypeListTemplate!Q94","v":0}]
[{"$f":"TypeListTemplate!A95","v":0},{"$f":"TypeListTemplate!B95","v":0},{"$f":"TypeListTemplate!C95","v":0},{"$f":"TypeListTemplate!D95","v":0},{"$f":"TypeListTemplate!E95","v":0},{"$f":"TypeListTemplate!F95","v":0},{"$f":"TypeListTemplate!G95","v":0},{"$f":"TypeListTemplate!H95","v":0},{"$f":"TypeListTemplate!I95","v":0},{"$f":"TypeListTemplate!J95","v":0},{"$f":"TypeListTemplate!K95","v":0},{"$f":"TypeListTemplate!L95","v":0},{"$f":"TypeListTemplate!M95","v":0},{"$f":"TypeListTemplate!N95","v":0},{"$f":"TypeListTemplate!O95","v":0},{"$f":"TypeListTemplate!P95","v":0},{"$f":"TypeListTemplate!Q95","v":0}]

{"sheet":"DriveSel","index":3,"n_rows":23,"n_cols":10,"rows_kept":23,"cut":false,"hidden":true,"merged":[]}
[null,"Motor and supply voltage",null,null,null,null,"Drive Product series",null,null,"non-US"]
[null,null,null,"Column Ordinate",null,null,0," - Pick the preferred product series! ->",null,{"$f":"IF(USUnits,FALSE,TRUE)","v":true}]
[null,0," - Select ->",0,null,null,1,"ACS55",{"$f":"H3","v":"ACS55"},{"$f":"'ACS55'!A$2","v":0}]
[null,{"$f":"B3+1","v":1}," 115 V (1-ph)",{"$f":"TypeListTemplate!D7","v":2},{"$f":"TypeListTemplate!D4","v":"115 V 1-ph"},null,2,"ACS150",{"$f":"H4","v":"ACS150"},{"$f":"'ACS150'!A$2","v":0}]
[null,{"$f":"B4+1","v":2}," 230 V (1-ph)",{"$f":"TypeListTemplate!F7","v":4},{"$f":"TypeListTemplate!F4","v":"200/208/230/240 V 1-ph"},null,3,"ACS310","ACS310",{"$f":"'ACS310'!A$2","v":0}]
[null,3," 230 V (3-ph)",{"$f":"TypeListTemplate!H7","v":6},{"$f":"TypeListTemplate!H4","v":"200/208/230/240 V 3-ph"},null,4,"ACS355",{"$f":"H6","v":"ACS355"},{"$f":"'ACS355'!A$2","v":0}]
[null,4," 400 V",{"$f":"TypeListTemplate!J7","v":8},{"$f":"TypeListTemplate!J4","v":"380/400/415 V"},null,5,"ACS550",{"$f":"H7","v":"ACS550"},{"$f":"'ACS550'!A$2","v":"ACS550-01-246A-4"}]
[null,5," 460 V",{"$f":"TypeListTemplate!L7","v":10},{"$f":"TypeListTemplate!L4","v":"440/460/480 V"},null,6,"ACH550","StdDrives",{"$f":"StdDrives!A$2","v":"ACH550-01-246A-4"}]
[null,6," 500 V",{"$f":"TypeListTemplate!N7","v":12},{"$f":"TypeListTemplate!N4","v":"500 V"},null,7,"ACS580","ACS580",{"$f":"'ACS580'!A2","v":"ACS580-01-246A-4"}]
[null,7," 690 V",{"$f":"TypeListTemplate!P7","v":14},{"$f":"TypeListTemplate!P4","v":"525/550/575/600/660/690 V"},null,8,"ACS800",{"$f":"H10","v":"ACS800"},{"$f":"'ACS800'!A2","v":"ACS800-01-0165-3"}]
[null,8," 2,3 kV",{"$f":"TypeListTemplate!R7","v":0},{"$f":"TypeListTemplate!R4","v":0},null,9,"ACQ810","ACQ810",{"$f":"'ACQ810'!A$2","v":"ACQ810-04-240A-4"}]
[null,9," 3,3 kV",{"$f":"TypeListTemplate!T7","v":0},{"$f":"TypeListTemplate!T4","v":0},null,10,"ACS880","ACS880",{"$f":"'ACS880'!A$2","v":"ACS880-01-246A-3"}]
[null,10," 4,16 kV",{"$f":"TypeListTemplate!V7","v":0},{"$f":"TypeListTemplate!V4","v":0}]
[null,11," 6,6 kV",{"$f":"TypeListTemplate!X7","v":0},{"$f":"TypeListTemplate!X4","v":0}]
[null,null,null,null,null,null,null,null,"Uncensored:",{"$f":"VLOOKUP($G$16,G3:J12,4,FALSE)","v":"ACS550-01-246A-4"}]
[null,null,null,null,null,null,5,{"$f":"VLOOKUP($G16,G3:H12,2,FALSE)","v":"ACS550"},{"$f":"VLOOKUP($G16,G3:I12,3,FALSE)","v":"ACS550"},{"$f":"IF(ISERROR(J15),\"0\",J15)","v":"ACS550-01-246A-4"}]
[null,null,null,null,null,null,null,null,null,{"$f":"IF(G16=0,\"\",IF(J16=0,\"No suitable type found.\",J16))","v":"ACS550-01-246A-4"}]
[null,4,{"$f":"VLOOKUP(B18,B3:C14,2)","v":" 400 V"},{"$f":"VLOOKUP(B18,B3:D14,3,FALSE)","v":8},{"$f":"VLOOKUP(B18,B3:E14,4)","v":"380/400/415 V"}]
[]
[null,null,null,"Rtd Mot P",{"$f":"IF(PumpCalculation,PumpRtdMotPower,FanRtdMotPower)","v":132},"kW"]
["PumpCalculation ?",null,true,null,132,"kW"]
["FanCalculation ?",null,{"$f":"IF(PumpCalculation,FALSE,TRUE)","v":false},null,{"$f":"IF(USUnits,0.7457*#REF!,#REF!)","v":{"$error":"#REF!"}},"kW"]
[null,null,""]

{"sheet":"TypeListTemplate","index":4,"n_rows":74,"n_cols":17,"rows_kept":74,"cut":false,"hidden":true,"merged":[]}
[null,null,null,"Voltage range 1",null,"Voltage range 2 (1-ph)",null,"Voltage range 2",null,"Voltage range 3",null,"Voltage range 4.6",null,"Voltage range 5",null,"Voltage range 7/6"]
[null,null,"non-US (50Hz)"," 115 V (1-ph)",null," 230 V (1-ph)",null," 230 V (3-ph)",null," 400 V",null," 460 V",null," 500 V",null," 690 V"]
["Col.ordinal","Col.ordinal"]
[null,null,"Alternatives:","115 V 1-ph",null,"200/208/230/240 V 1-ph",null,"200/208/230/240 V 3-ph",null,"380/400/415 V",null,"440/460/480 V",null,"500 V",null,"525/550/575/600/660/690 V"]
["Motor Power","Motor",null,"Drive type",null,"Drive type",null,"Drive type",null,"Drive type",null,"Drive type",null,"Drive type",null,"Drive type"]
["Hp","power kW"]
[null,"Column Ordinal ->",1,{"$f":"C7+1","v":2},{"$f":"D7+1","v":3},4,5,6,7,8,9,10,11,12,13,14,15]
[{"$f":"B8/0.7457","v":0},0,0]
[7.3756202226096287E-2,5.5E-2,{"$f":"B8+0.01","v":0.01}]
[0.12069196727906664,0.09,6.5000000000000002E-2]
[0.16092262303875551,0.12,9.9999999999999992E-2]
[0.24138393455813328,0.18,0.13]
[0.49617808770282951,0.37,0.19]
[0.7375620222609629,0.55000000000000004,0.38]
[1.0057663939922221,0.75,0.56000000000000005]
[1.4751240445219258,1.1000000000000001,0.76]
[2.0115327879844442,1.5,1.1100000000000001]
[2.9502480890438516,2.2000000000000002,1.51]
[4.0230655759688885,3,2.21]
[5,{"$f":"0.7457*A20","v":3.7285000000000004},3.01]
[{"$f":"B21/0.7457","v":5.3640874346251843},4,3.7385000000000002]
[7.3756202226096281,5.5,4.01]
[10.05766393992222,7.5,5.51]
[14.751240445219256,11,7.51]
[20.11532787984444,15,11.01]
[24.808904385141478,18.5,15.01]
[29.502480890438513,22,18.510000000000002]
[40.230655759688879,30,22.01]
[49.617808770282956,37,30.01]
[60.345983639533323,45,37.01]
[73.756202226096278,55,45.01]
[100.5766393992222,75,55.01]
[120.69196727906665,90,75.010000000000005]
[147.51240445219256,110,90.01]
[177.01488534263109,132,110.01]
[200,{"$f":"0.7457*A36","v":149.14000000000001},132.01]
[{"$f":"B37/0.7457","v":214.56349738500737},160,149.15]
[250,{"$f":"A38*0.7457","v":186.42500000000001},160.01]
[{"$f":"B39/0.7457","v":268.20437173125919},200,186.435]
[300,{"$f":"A40*0.7457","v":223.71},200.01]
[{"$f":"B41/0.7457","v":335.255464664074},250,223.72]
[400,{"$f":"A42*0.7457","v":298.28000000000003},250.01]
[{"$f":"B43/0.7457","v":422.42188547673328},315,298.29000000000002]
[476.06275982298507,355,315.01]
[536.40874346251837,400,355.01]
[603.45983639533324,450,{"$f":"B45+0.01","v":400.01}]
[670.51092932814799,500,450.01]
[750.97224084752577,560,500.01]
[844.84377095346656,630,560.01]
[952.12551964597014,710,630.01]
[1072.8174869250367,800,710.01]
[1206.9196727906665,900,800.01]
[1341.021858656296,1000,900.01]
[1501.9444816950515,1120,1000.01]
[1676.27732332037,1250,1120.01]
[1877.4306021188145,1400,1250.01]
[2145.6349738500735,1600,1400.01]
[2346.7882526485182,1750,1600.01]
[2413.839345581333,1800,{"$f":"B58+0.01","v":1750.01}]
[2682.043717312592,2000,1800.01]
[2950.2480890438515,2200,2000.01]
[3017.2991819766662,2250,2200.0100000000002]
[3084.350274909481,2300,2250.0100000000002]
[3352.55464664074,2500,2300.0100000000002]
[3754.861204237629,2800,2500.0100000000002]
[4224.2188547673322,3150,2800.01]
[4760.6275982298512,3550,3150.01]
[5364.087434625184,4000,3550.01]
[6034.5983639533324,4500,4000.01]
[6705.1092932814799,5000,4500.01]
[null,999999999,5000.01]
[]
[null,null,null,"Drive type",null,"Drive type",null,"Drive type",null,"Drive type",null,"Drive type",null,"Drive type",null,"Drive type"]
[null,null,null,{"$f":"D2","v":" 115 V (1-ph)"},null,{"$f":"F2","v":" 230 V (1-ph)"},null,{"$f":"H2","v":" 230 V (3-ph)"},null,{"$f":"J2","v":" 400 V"},null,{"$f":"L2","v":" 460 V"},null,{"$f":"N2","v":" 500 V"},null,{"$f":"P2","v":" 690 V"}]

{"sheet":"ACS55","index":5,"n_rows":95,"n_cols":17,"rows_kept":95,"cut":false,"hidden":true,"merged":[]}
["Typecode","Prod.class",null,"Voltage range 1",null,"Voltage range 2 (1-ph)",null,"Voltage range 2",null,"Voltage range 3",null,"Voltage range 4.6",null,"Voltage range 5",null,"Voltage range 7/6"]
[{"$f":"VLOOKUP(DriveSel!E20,C8:Y71,DriveSel!D18)","v":0},{"$f":"VLOOKUP(#REF!,C8:X70,7)","v":{"$error":"#REF!"}},"non-US (50Hz)"," 115 V (1-ph)",null," 230 V (1-ph)",null," 230 V (3-ph)",null," 400 V",null," 460 V",null," 500 V",null," 690 V"]
["Col.ordinal","Col.ordinal"]
[null,null,"Alternatives:","115 V 1-ph",null,"200/208/230/240 V 1-ph",null,"200/208/230/240 V 3-ph",null,"380/400/415 V",null,"440/460/480 V",null,"500 V",null,"525/550/575/600/660/690 V"]
[{"$f":"TypeListTemplate!A5","v":"Motor Power"},{"$f":"TypeListTemplate!B5","v":"Motor"},{"$f":"TypeListTemplate!C5","v":0},{"$f":"TypeListTemplate!D5","v":"Drive type"},{"$f":"TypeListTemplate!E5","v":0},{"$f":"TypeListTemplate!F5","v":"Drive type"},{"$f":"TypeListTemplate!G5","v":0},{"$f":"TypeListTemplate!H5","v":"Drive type"},{"$f":"TypeListTemplate!I5","v":0},{"$f":"TypeListTemplate!J5","v":"Drive type"},{"$f":"TypeListTemplate!K5","v":0},{"$f":"TypeListTemplate!L5","v":"Drive type"},{"$f":"TypeListTemplate!M5","v":0},{"$f":"TypeListTemplate!N5","v":"Drive type"},{"$f":"TypeListTemplate!O5","v":0},{"$f":"TypeListTemplate!P5","v":"Drive type"},{"$f":"TypeListTemplate!Q5","v":0}]
[{"$f":"TypeListTemplate!A6","v":"Hp"},{"$f":"TypeListTemplate!B6","v":"power kW"}]
[{"$f":"TypeListTemplate!A7","v":0},{"$f":"TypeListTemplate!B7","v":"Column Ordinal ->"},{"$f":"TypeListTemplate!C7","v":1},{"$f":"TypeListTemplate!D7","v":2},{"$f":"TypeListTemplate!E7","v":3},{"$f":"TypeListTemplate!F7","v":4},{"$f":"TypeListTemplate!G7","v":5},{"$f":"TypeListTemplate!H7","v":6},{"$f":"TypeListTemplate!I7","v":7},{"$f":"TypeListTemplate!J7","v":8},{"$f":"TypeListTemplate!K7","v":9},{"$f":"TypeListTemplate!L7","v":10},{"$f":"TypeListTemplate!M7","v":11},{"$f":"TypeListTemplate!N7","v":12},{"$f":"TypeListTemplate!O7","v":13},{"$f":"TypeListTemplate!P7","v":14},{"$f":"TypeListTemplate!Q7","v":15}]
[{"$f":"TypeListTemplate!A8","v":0},{"$f":"TypeListTemplate!B8","v":0},{"$f":"TypeListTemplate!C8","v":0}]
[{"$f":"TypeListTemplate!A9","v":7.3756202226096287E-2},{"$f":"TypeListTemplate!B9","v":5.5E-2},{"$f":"TypeListTemplate!C9","v":0.01}]
[{"$f":"TypeListTemplate!A10","v":0.12069196727906664},{"$f":"TypeListTemplate!B10","v":0.09},{"$f":"TypeListTemplate!C10","v":6.5000000000000002E-2},"ACS55-01E-01A4-1"]
[{"$f":"TypeListTemplate!A11","v":0.16092262303875551},{"$f":"TypeListTemplate!B11","v":0.12},{"$f":"TypeListTemplate!C11","v":9.9999999999999992E-2},"ACS55-01E-01A4-1",null,"ACS55-01E-01A4-2"]
[{"$f":"TypeListTemplate!A12","v":0.24138393455813328},{"$f":"TypeListTemplate!B12","v":0.18},{"$f":"TypeListTemplate!C12","v":0.13},"ACS55-01E-01A4-1",null,"ACS55-01E-01A4-2"]
[{"$f":"TypeListTemplate!A13","v":0.49617808770282951},{"$f":"TypeListTemplate!B13","v":0.37},{"$f":"TypeListTemplate!C13","v":0.19},"ACS55-01E-02A2-1",null,"ACS55-01E-02A2-2"]
[{"$f":"TypeListTemplate!A14","v":0.7375620222609629},{"$f":"TypeListTemplate!B14","v":0.55000000000000004},{"$f":"TypeListTemplate!C14","v":0.38},null,null,"ACS55-01E-04A3-2"]
[{"$f":"TypeListTemplate!A15","v":1.0057663939922221},{"$f":"TypeListTemplate!B15","v":0.75},{"$f":"TypeListTemplate!C15","v":0.56000000000000005},null,null,"ACS55-01E-04A3-2"]
[{"$f":"TypeListTemplate!A16","v":1.4751240445219258},{"$f":"TypeListTemplate!B16","v":1.1000000000000001},{"$f":"TypeListTemplate!C16","v":0.76},null,null,"ACS55-01E-07A6-2"]
[{"$f":"TypeListTemplate!A17","v":2.0115327879844442},{"$f":"TypeListTemplate!B17","v":1.5},{"$f":"TypeListTemplate!C17","v":1.1100000000000001},null,null,"ACS55-01E-07A6-2"]
[{"$f":"TypeListTemplate!A18","v":2.9502480890438516},{"$f":"TypeListTemplate!B18","v":2.2000000000000002},{"$f":"TypeListTemplate!C18","v":1.51},null,null,"ACS55-01E-09A8-2"]
[{"$f":"TypeListTemplate!A19","v":4.0230655759688885},{"$f":"TypeListTemplate!B19","v":3},{"$f":"TypeListTemplate!C19","v":2.21}]
[{"$f":"TypeListTemplate!A20","v":5},{"$f":"TypeListTemplate!B20","v":3.7285000000000004},{"$f":"TypeListTemplate!C20","v":3.01}]
[{"$f":"TypeListTemplate!A21","v":5.3640874346251843},{"$f":"TypeListTemplate!B21","v":4},{"$f":"TypeListTemplate!C21","v":3.7385000000000002}]
[{"$f":"TypeListTemplate!A22","v":7.3756202226096281},{"$f":"TypeListTemplate!B22","v":5.5},{"$f":"TypeListTemplate!C22","v":4.01}]
[{"$f":"TypeListTemplate!A23","v":10.05766393992222},{"$f":"TypeListTemplate!B23","v":7.5},{"$f":"TypeListTemplate!C23","v":5.51}]
[{"$f":"TypeListTemplate!A24","v":14.751240445219256},{"$f":"TypeListTemplate!B24","v":11},{"$f":"TypeListTemplate!C24","v":7.51}]
[{"$f":"TypeListTemplate!A25","v":20.11532787984444},{"$f":"TypeListTemplate!B25","v":15},{"$f":"TypeListTemplate!C25","v":11.01}]
[{"$f":"TypeListTemplate!A26","v":24.808904385141478},{"$f":"TypeListTemplate!B26","v":18.5},{"$f":"TypeListTemplate!C26","v":15.01}]
[{"$f":"TypeListTemplate!A27","v":29.502480890438513},{"$f":"TypeListTemplate!B27","v":22},{"$f":"TypeListTemplate!C27","v":18.510000000000002}]
[{"$f":"TypeListTemplate!A28","v":40.230655759688879},{"$f":"TypeListTemplate!B28","v":30},{"$f":"TypeListTemplate!C28","v":22.01}]
[{"$f":"TypeListTemplate!A29","v":49.617808770282956},{"$f":"TypeListTemplate!B29","v":37},{"$f":"TypeListTemplate!C29","v":30.01}]
[{"$f":"TypeListTemplate!A30","v":60.345983639533323},{"$f":"TypeListTemplate!B30","v":45},{"$f":"TypeListTemplate!C30","v":37.01}]
[{"$f":"TypeListTemplate!A31","v":73.756202226096278},{"$f":"TypeListTemplate!B31","v":55},{"$f":"TypeListTemplate!C31","v":45.01}]
[{"$f":"TypeListTemplate!A32","v":100.5766393992222},{"$f":"TypeListTemplate!B32","v":75},{"$f":"TypeListTemplate!C32","v":55.01}]
[{"$f":"TypeListTemplate!A33","v":120.69196727906665},{"$f":"TypeListTemplate!B33","v":90},{"$f":"TypeListTemplate!C33","v":75.010000000000005}]
[{"$f":"TypeListTemplate!A34","v":147.51240445219256},{"$f":"TypeListTemplate!B34","v":110},{"$f":"TypeListTemplate!C34","v":90.01}]
[{"$f":"TypeListTemplate!A35","v":177.01488534263109},{"$f":"TypeListTemplate!B35","v":132},{"$f":"TypeListTemplate!C35","v":110.01}]
[{"$f":"TypeListTemplate!A36","v":200},{"$f":"TypeListTemplate!B36","v":149.14000000000001},{"$f":"TypeListTemplate!C36","v":132.01}]
[{"$f":"TypeListTemplate!A37","v":214.56349738500737},{"$f":"TypeListTemplate!B37","v":160},{"$f":"TypeListTemplate!C37","v":149.15}]
[{"$f":"TypeListTemplate!A38","v":250},{"$f":"TypeListTemplate!B38","v":186.42500000000001},{"$f":"TypeListTemplate!C38","v":160.01}]
[{"$f":"TypeListTemplate!A39","v":268.20437173125919},{"$f":"TypeListTemplate!B39","v":200},{"$f":"TypeListTemplate!C39","v":186.435}]
[{"$f":"TypeListTemplate!A40","v":300},{"$f":"TypeListTemplate!B40","v":223.71},{"$f":"TypeListTemplate!C40","v":200.01}]
[{"$f":"TypeListTemplate!A41","v":335.255464664074},{"$f":"TypeListTemplate!B41","v":250},{"$f":"TypeListTemplate!C41","v":223.72}]
[{"$f":"TypeListTemplate!A42","v":400},{"$f":"TypeListTemplate!B42","v":298.28000000000003},{"$f":"TypeListTemplate!C42","v":250.01}]
[{"$f":"TypeListTemplate!A43","v":422.42188547673328},{"$f":"TypeListTemplate!B43","v":315},{"$f":"TypeListTemplate!C43","v":298.29000000000002}]
[{"$f":"TypeListTemplate!A44","v":476.06275982298507},{"$f":"TypeListTemplate!B44","v":355},{"$f":"TypeListTemplate!C44","v":315.01}]
[{"$f":"TypeListTemplate!A45","v":536.40874346251837},{"$f":"TypeListTemplate!B45","v":400},{"$f":"TypeListTemplate!C45","v":355.01}]
[{"$f":"TypeListTemplate!A46","v":603.45983639533324},{"$f":"TypeListTemplate!B46","v":450},{"$f":"TypeListTemplate!C46","v":400.01}]
[{"$f":"TypeListTemplate!A47","v":670.51092932814799},{"$f":"TypeListTemplate!B47","v":500},{"$f":"TypeListTemplate!C47","v":450.01}]
[{"$f":"TypeListTemplate!A48","v":750.97224084752577},{"$f":"TypeListTemplate!B48","v":560},{"$f":"TypeListTemplate!C48","v":500.01}]
[{"$f":"TypeListTemplate!A49","v":844.84377095346656},{"$f":"TypeListTemplate!B49","v":630},{"$f":"TypeListTemplate!C49","v":560.01}]
[{"$f":"TypeListTemplate!A50","v":952.12551964597014},{"$f":"TypeListTemplate!B50","v":710},{"$f":"TypeListTemplate!C50","v":630.01}]
[{"$f":"TypeListTemplate!A51","v":1072.8174869250367},{"$f":"TypeListTemplate!B51","v":800},{"$f":"TypeListTemplate!C51","v":710.01}]
[{"$f":"TypeListTemplate!A52","v":1206.9196727906665},{"$f":"TypeListTemplate!B52","v":900},{"$f":"TypeListTemplate!C52","v":800.01}]
[{"$f":"TypeListTemplate!A53","v":1341.021858656296},{"$f":"TypeListTemplate!B53","v":1000},{"$f":"TypeListTemplate!C53","v":900.01}]
[{"$f":"TypeListTemplate!A54","v":1501.9444816950515},{"$f":"TypeListTemplate!B54","v":1120},{"$f":"TypeListTemplate!C54","v":1000.01}]
[{"$f":"TypeListTemplate!A55","v":1676.27732332037},{"$f":"TypeListTemplate!B55","v":1250},{"$f":"TypeListTemplate!C55","v":1120.01}]
[{"$f":"TypeListTemplate!A56","v":1877.4306021188145},{"$f":"TypeListTemplate!B56","v":1400},{"$f":"TypeListTemplate!C56","v":1250.01}]
[{"$f":"TypeListTemplate!A57","v":2145.6349738500735},{"$f":"TypeListTemplate!B57","v":1600},{"$f":"TypeListTemplate!C57","v":1400.01}]
[{"$f":"TypeListTemplate!A58","v":2346.7882526485182},{"$f":"TypeListTemplate!B58","v":1750},{"$f":"TypeListTemplate!C58","v":1600.01}]
[{"$f":"TypeListTemplate!A59","v":2413.839345581333},{"$f":"TypeListTemplate!B59","v":1800},{"$f":"TypeListTemplate!C59","v":1750.01}]
[{"$f":"TypeListTemplate!A60","v":2682.043717312592},{"$f":"TypeListTemplate!B60","v":2000},{"$f":"TypeListTemplate!C60","v":1800.01}]
[{"$f":"TypeListTemplate!A61","v":2950.2480890438515},{"$f":"TypeListTemplate!B61","v":2200},{"$f":"TypeListTemplate!C61","v":2000.01}]
[{"$f":"TypeListTemplate!A62","v":3017.2991819766662},{"$f":"TypeListTemplate!B62","v":2250},{"$f":"TypeListTemplate!C62","v":2200.0100000000002}]
[{"$f":"TypeListTemplate!A63","v":3084.350274909481},{"$f":"TypeListTemplate!B63","v":2300},{"$f":"TypeListTemplate!C63","v":2250.0100000000002}]
[{"$f":"TypeListTemplate!A64","v":3352.55464664074},{"$f":"TypeListTemplate!B64","v":2500},{"$f":"TypeListTemplate!C64","v":2300.0100000000002}]
[{"$f":"TypeListTemplate!A65","v":3754.861204237629},{"$f":"TypeListTemplate!B65","v":2800},{"$f":"TypeListTemplate!C65","v":2500.0100000000002}]
[{"$f":"TypeListTemplate!A66","v":4224.2188547673322},{"$f":"TypeListTemplate!B66","v":3150},{"$f":"TypeListTemplate!C66","v":2800.01}]
[{"$f":"TypeListTemplate!A67","v":4760.6275982298512},{"$f":"TypeListTemplate!B67","v":3550},{"$f":"TypeListTemplate!C67","v":3150.01}]
[{"$f":"TypeListTemplate!A68","v":5364.087434625184},{"$f":"TypeListTemplate!B68","v":4000},{"$f":"TypeListTemplate!C68","v":3550.01}]
[{"$f":"TypeListTemplate!A69","v":6034.5983639533324},{"$f":"TypeListTemplate!B69","v":4500},{"$f":"TypeListTemplate!C69","v":4000.01}]
[{"$f":"TypeListTemplate!A70","v":6705.1092932814799},{"$f":"TypeListTemplate!B70","v":5000},{"$f":"TypeListTemplate!C70","v":4500.01}]
[{"$f":"TypeListTemplate!A71","v":0},{"$f":"TypeListTemplate!B71","v":999999999},{"$f":"TypeListTemplate!C71","v":5000.01}]
[{"$f":"TypeListTemplate!A72","v":0},{"$f":"TypeListTemplate!B72","v":0},{"$f":"TypeListTemplate!C72","v":0}]
[{"$f":"TypeListTemplate!A73","v":0},{"$f":"TypeListTemplate!B73","v":0},{"$f":"TypeListTemplate!C73","v":0},{"$f":"TypeListTemplate!D73","v":"Drive type"},{"$f":"TypeListTemplate!E73","v":0},{"$f":"TypeListTemplate!F73","v":"Drive type"},{"$f":"TypeListTemplate!G73","v":0},{"$f":"TypeListTemplate!H73","v":"Drive type"},{"$f":"TypeListTemplate!I73","v":0},{"$f":"TypeListTemplate!J73","v":"Drive type"},{"$f":"TypeListTemplate!K73","v":0},{"$f":"TypeListTemplate!L73","v":"Drive type"},{"$f":"TypeListTemplate!M73","v":0},{"$f":"TypeListTemplate!N73","v":"Drive type"},{"$f":"TypeListTemplate!O73","v":0},{"$f":"TypeListTemplate!P73","v":"Drive type"},{"$f":"TypeListTemplate!Q73","v":0}]
[{"$f":"TypeListTemplate!A74","v":0},{"$f":"TypeListTemplate!B74","v":0},{"$f":"TypeListTemplate!C74","v":0},{"$f":"TypeListTemplate!D74","v":" 115 V (1-ph)"},{"$f":"TypeListTemplate!E74","v":0},{"$f":"TypeListTemplate!F74","v":" 230 V (1-ph)"},{"$f":"TypeListTemplate!G74","v":0},{"$f":"TypeListTemplate!H74","v":" 230 V (3-ph)"},{"$f":"TypeListTemplate!I74","v":0},{"$f":"TypeListTemplate!J74","v":" 400 V"},{"$f":"TypeListTemplate!K74","v":0},{"$f":"TypeListTemplate!L74","v":" 460 V"},{"$f":"TypeListTemplate!M74","v":0},{"$f":"TypeListTemplate!N74","v":" 500 V"},{"$f":"TypeListTemplate!O74","v":0},{"$f":"TypeListTemplate!P74","v":" 690 V"},{"$f":"TypeListTemplate!Q74","v":0}]
[{"$f":"TypeListTemplate!A75","v":0},{"$f":"TypeListTemplate!B75","v":0},{"$f":"TypeListTemplate!C75","v":0},{"$f":"TypeListTemplate!D75","v":0},{"$f":"TypeListTemplate!E75","v":0},{"$f":"TypeListTemplate!F75","v":0},{"$f":"TypeListTemplate!G75","v":0},{"$f":"TypeListTemplate!H75","v":0},{"$f":"TypeListTemplate!I75","v":0},{"$f":"TypeListTemplate!J75","v":0},{"$f":"TypeListTemplate!K75","v":0},{"$f":"TypeListTemplate!L75","v":0},{"$f":"TypeListTemplate!M75","v":0},{"$f":"TypeListTemplate!N75","v":0},{"$f":"TypeListTemplate!O75","v":0},{"$f":"TypeListTemplate!P75","v":0},{"$f":"TypeListTemplate!Q75","v":0}]
[{"$f":"TypeListTemplate!A76","v":0},{"$f":"TypeListTemplate!B76","v":0},{"$f":"TypeListTemplate!C76","v":0},{"$f":"TypeListTemplate!D76","v":0},{"$f":"TypeListTemplate!E76","v":0},{"$f":"TypeListTemplate!F76","v":0},{"$f":"TypeListTemplate!G76","v":0},{"$f":"TypeListTemplate!H76","v":0},{"$f":"TypeListTemplate!I76","v":0},{"$f":"TypeListTemplate!J76","v":0},{"$f":"TypeListTemplate!K76","v":0},{"$f":"TypeListTemplate!L76","v":0},{"$f":"TypeListTemplate!M76","v":0},{"$f":"TypeListTemplate!N76","v":0},{"$f":"TypeListTemplate!O76","v":0},{"$f":"TypeListTemplate!P76","v":0},{"$f":"TypeListTemplate!Q76","v":0}]
[{"$f":"TypeListTemplate!A77","v":0},{"$f":"TypeListTemplate!B77","v":0},{"$f":"TypeListTemplate!C77","v":0},{"$f":"TypeListTemplate!D77","v":0},{"$f":"TypeListTemplate!E77","v":0},{"$f":"TypeListTemplate!F77","v":0},{"$f":"TypeListTemplate!G77","v":0},{"$f":"TypeListTemplate!H77","v":0},{"$f":"TypeListTemplate!I77","v":0},{"$f":"TypeListTemplate!J77","v":0},{"$f":"TypeListTemplate!K77","v":0},{"$f":"TypeListTemplate!L77","v":0},{"$f":"TypeListTemplate!M77","v":0},{"$f":"TypeListTemplate!N77","v":0},{"$f":"TypeListTemplate!O77","v":0},{"$f":"TypeListTemplate!P77","v":0},{"$f":"TypeListTemplate!Q77","v":0}]
[{"$f":"TypeListTemplate!A78","v":0},{"$f":"TypeListTemplate!B78","v":0},{"$f":"TypeListTemplate!C78","v":0},{"$f":"TypeListTemplate!D78","v":0},{"$f":"TypeListTemplate!E78","v":0},{"$f":"TypeListTemplate!F78","v":0},{"$f":"TypeListTemplate!G78","v":0},{"$f":"TypeListTemplate!H78","v":0},{"$f":"TypeListTemplate!I78","v":0},{"$f":"TypeListTemplate!J78","v":0},{"$f":"TypeListTemplate!K78","v":0},{"$f":"TypeListTemplate!L78","v":0},{"$f":"TypeListTemplate!M78","v":0},{"$f":"TypeListTemplate!N78","v":0},{"$f":"TypeListTemplate!O78","v":0},{"$f":"TypeListTemplate!P78","v":0},{"$f":"TypeListTemplate!Q78","v":0}]
[{"$f":"TypeListTemplate!A79","v":0},{"$f":"TypeListTemplate!B79","v":0},{"$f":"TypeListTemplate!C79","v":0},{"$f":"TypeListTemplate!D79","v":0},{"$f":"TypeListTemplate!E79","v":0},{"$f":"TypeListTemplate!F79","v":0},{"$f":"TypeListTemplate!G79","v":0},{"$f":"TypeListTemplate!H79","v":0},{"$f":"TypeListTemplate!I79","v":0},{"$f":"TypeListTemplate!J79","v":0},{"$f":"TypeListTemplate!K79","v":0},{"$f":"TypeListTemplate!L79","v":0},{"$f":"TypeListTemplate!M79","v":0},{"$f":"TypeListTemplate!N79","v":0},{"$f":"TypeListTemplate!O79","v":0},{"$f":"TypeListTemplate!P79","v":0},{"$f":"TypeListTemplate!Q79","v":0}]
[{"$f":"TypeListTemplate!A80","v":0},{"$f":"TypeListTemplate!B80","v":0},{"$f":"TypeListTemplate!C80","v":0},{"$f":"TypeListTemplate!D80","v":0},{"$f":"TypeListTemplate!E80","v":0},{"$f":"TypeListTemplate!F80","v":0},{"$f":"TypeListTemplate!G80","v":0},{"$f":"TypeListTemplate!H80","v":0},{"$f":"TypeListTemplate!I80","v":0},{"$f":"TypeListTemplate!J80","v":0},{"$f":"TypeListTemplate!K80","v":0},{"$f":"TypeListTemplate!L80","v":0},{"$f":"TypeListTemplate!M80","v":0},{"$f":"TypeListTemplate!N80","v":0},{"$f":"TypeListTemplate!O80","v":0},{"$f":"TypeListTemplate!P80","v":0},{"$f":"TypeListTemplate!Q80","v":0}]
[{"$f":"TypeListTemplate!A81","v":0},{"$f":"TypeListTemplate!B81","v":0},{"$f":"TypeListTemplate!C81","v":0},{"$f":"TypeListTemplate!D81","v":0},{"$f":"TypeListTemplate!E81","v":0},{"$f":"TypeListTemplate!F81","v":0},{"$f":"TypeListTemplate!G81","v":0},{"$f":"TypeListTemplate!H81","v":0},{"$f":"TypeListTemplate!I81","v":0},{"$f":"TypeListTemplate!J81","v":0},{"$f":"TypeListTemplate!K81","v":0},{"$f":"TypeListTemplate!L81","v":0},{"$f":"TypeListTemplate!M81","v":0},{"$f":"TypeListTemplate!N81","v":0},{"$f":"TypeListTemplate!O81","v":0},{"$f":"TypeListTemplate!P81","v":0},{"$f":"TypeListTemplate!Q81","v":0}]
[{"$f":"TypeListTemplate!A82","v":0},{"$f":"TypeListTemplate!B82","v":0},{"$f":"TypeListTemplate!C82","v":0},{"$f":"TypeListTemplate!D82","v":0},{"$f":"TypeListTemplate!E82","v":0},{"$f":"TypeListTemplate!F82","v":0},{"$f":"TypeListTemplate!G82","v":0},{"$f":"TypeListTemplate!H82","v":0},{"$f":"TypeListTemplate!I82","v":0},{"$f":"TypeListTemplate!J82","v":0},{"$f":"TypeListTemplate!K82","v":0},{"$f":"TypeListTemplate!L82","v":0},{"$f":"TypeListTemplate!M82","v":0},{"$f":"TypeListTemplate!N82","v":0},{"$f":"TypeListTemplate!O82","v":0},{"$f":"TypeListTemplate!P82","v":0},{"$f":"TypeListTemplate!Q82","v":0}]
[{"$f":"TypeListTemplate!A83","v":0},{"$f":"TypeListTemplate!B83","v":0},{"$f":"TypeListTemplate!C83","v":0},{"$f":"TypeListTemplate!D83","v":0},{"$f":"TypeListTemplate!E83","v":0},{"$f":"TypeListTemplate!F83","v":0},{"$f":"TypeListTemplate!G83","v":0},{"$f":"TypeListTemplate!H83","v":0},{"$f":"TypeListTemplate!I83","v":0},{"$f":"TypeListTemplate!J83","v":0},{"$f":"TypeListTemplate!K83","v":0},{"$f":"TypeListTemplate!L83","v":0},{"$f":"TypeListTemplate!M83","v":0},{"$f":"TypeListTemplate!N83","v":0},{"$f":"TypeListTemplate!O83","v":0},{"$f":"TypeListTemplate!P83","v":0},{"$f":"TypeListTemplate!Q83","v":0}]
[{"$f":"TypeListTemplate!A84","v":0},{"$f":"TypeListTemplate!B84","v":0},{"$f":"TypeListTemplate!C84","v":0},{"$f":"TypeListTemplate!D84","v":0},{"$f":"TypeListTemplate!E84","v":0},{"$f":"TypeListTemplate!F84","v":0},{"$f":"TypeListTemplate!G84","v":0},{"$f":"TypeListTemplate!H84","v":0},{"$f":"TypeListTemplate!I84","v":0},{"$f":"TypeListTemplate!J84","v":0},{"$f":"TypeListTemplate!K84","v":0},{"$f":"TypeListTemplate!L84","v":0},{"$f":"TypeListTemplate!M84","v":0},{"$f":"TypeListTemplate!N84","v":0},{"$f":"TypeListTemplate!O84","v":0},{"$f":"TypeListTemplate!P84","v":0},{"$f":"TypeListTemplate!Q84","v":0}]
[{"$f":"TypeListTemplate!A85","v":0},{"$f":"TypeListTemplate!B85","v":0},{"$f":"TypeListTemplate!C85","v":0},{"$f":"TypeListTemplate!D85","v":0},{"$f":"TypeListTemplate!E85","v":0},{"$f":"TypeListTemplate!F85","v":0},{"$f":"TypeListTemplate!G85","v":0},{"$f":"TypeListTemplate!H85","v":0},{"$f":"TypeListTemplate!I85","v":0},{"$f":"TypeListTemplate!J85","v":0},{"$f":"TypeListTemplate!K85","v":0},{"$f":"TypeListTemplate!L85","v":0},{"$f":"TypeListTemplate!M85","v":0},{"$f":"TypeListTemplate!N85","v":0},{"$f":"TypeListTemplate!O85","v":0},{"$f":"TypeListTemplate!P85","v":0},{"$f":"TypeListTemplate!Q85","v":0}]
[{"$f":"TypeListTemplate!A86","v":0},{"$f":"TypeListTemplate!B86","v":0},{"$f":"TypeListTemplate!C86","v":0},{"$f":"TypeListTemplate!D86","v":0},{"$f":"TypeListTemplate!E86","v":0},{"$f":"TypeListTemplate!F86","v":0},{"$f":"TypeListTemplate!G86","v":0},{"$f":"TypeListTemplate!H86","v":0},{"$f":"TypeListTemplate!I86","v":0},{"$f":"TypeListTemplate!J86","v":0},{"$f":"TypeListTemplate!K86","v":0},{"$f":"TypeListTemplate!L86","v":0},{"$f":"TypeListTemplate!M86","v":0},{"$f":"TypeListTemplate!N86","v":0},{"$f":"TypeListTemplate!O86","v":0},{"$f":"TypeListTemplate!P86","v":0},{"$f":"TypeListTemplate!Q86","v":0}]
[{"$f":"TypeListTemplate!A87","v":0},{"$f":"TypeListTemplate!B87","v":0},{"$f":"TypeListTemplate!C87","v":0},{"$f":"TypeListTemplate!D87","v":0},{"$f":"TypeListTemplate!E87","v":0},{"$f":"TypeListTemplate!F87","v":0},{"$f":"TypeListTemplate!G87","v":0},{"$f":"TypeListTemplate!H87","v":0},{"$f":"TypeListTemplate!I87","v":0},{"$f":"TypeListTemplate!J87","v":0},{"$f":"TypeListTemplate!K87","v":0},{"$f":"TypeListTemplate!L87","v":0},{"$f":"TypeListTemplate!M87","v":0},{"$f":"TypeListTemplate!N87","v":0},{"$f":"TypeListTemplate!O87","v":0},{"$f":"TypeListTemplate!P87","v":0},{"$f":"TypeListTemplate!Q87","v":0}]
[{"$f":"TypeListTemplate!A88","v":0},{"$f":"TypeListTemplate!B88","v":0},{"$f":"TypeListTemplate!C88","v":0},{"$f":"TypeListTemplate!D88","v":0},{"$f":"TypeListTemplate!E88","v":0},{"$f":"TypeListTemplate!F88","v":0},{"$f":"TypeListTemplate!G88","v":0},{"$f":"TypeListTemplate!H88","v":0},{"$f":"TypeListTemplate!I88","v":0},{"$f":"TypeListTemplate!J88","v":0},{"$f":"TypeListTemplate!K88","v":0},{"$f":"TypeListTemplate!L88","v":0},{"$f":"TypeListTemplate!M88","v":0},{"$f":"TypeListTemplate!N88","v":0},{"$f":"TypeListTemplate!O88","v":0},{"$f":"TypeListTemplate!P88","v":0},{"$f":"TypeListTemplate!Q88","v":0}]
[{"$f":"TypeListTemplate!A89","v":0},{"$f":"TypeListTemplate!B89","v":0},{"$f":"TypeListTemplate!C89","v":0},{"$f":"TypeListTemplate!D89","v":0},{"$f":"TypeListTemplate!E89","v":0},{"$f":"TypeListTemplate!F89","v":0},{"$f":"TypeListTemplate!G89","v":0},{"$f":"TypeListTemplate!H89","v":0},{"$f":"TypeListTemplate!I89","v":0},{"$f":"TypeListTemplate!J89","v":0},{"$f":"TypeListTemplate!K89","v":0},{"$f":"TypeListTemplate!L89","v":0},{"$f":"TypeListTemplate!M89","v":0},{"$f":"TypeListTemplate!N89","v":0},{"$f":"TypeListTemplate!O89","v":0},{"$f":"TypeListTemplate!P89","v":0},{"$f":"TypeListTemplate!Q89","v":0}]
[{"$f":"TypeListTemplate!A90","v":0},{"$f":"TypeListTemplate!B90","v":0},{"$f":"TypeListTemplate!C90","v":0},{"$f":"TypeListTemplate!D90","v":0},{"$f":"TypeListTemplate!E90","v":0},{"$f":"TypeListTemplate!F90","v":0},{"$f":"TypeListTemplate!G90","v":0},{"$f":"TypeListTemplate!H90","v":0},{"$f":"TypeListTemplate!I90","v":0},{"$f":"TypeListTemplate!J90","v":0},{"$f":"TypeListTemplate!K90","v":0},{"$f":"TypeListTemplate!L90","v":0},{"$f":"TypeListTemplate!M90","v":0},{"$f":"TypeListTemplate!N90","v":0},{"$f":"TypeListTemplate!O90","v":0},{"$f":"TypeListTemplate!P90","v":0},{"$f":"TypeListTemplate!Q90","v":0}]
[{"$f":"TypeListTemplate!A91","v":0},{"$f":"TypeListTemplate!B91","v":0},{"$f":"TypeListTemplate!C91","v":0},{"$f":"TypeListTemplate!D91","v":0},{"$f":"TypeListTemplate!E91","v":0},{"$f":"TypeListTemplate!F91","v":0},{"$f":"TypeListTemplate!G91","v":0},{"$f":"TypeListTemplate!H91","v":0},{"$f":"TypeListTemplate!I91","v":0},{"$f":"TypeListTemplate!J91","v":0},{"$f":"TypeListTemplate!K91","v":0},{"$f":"TypeListTemplate!L91","v":0},{"$f":"TypeListTemplate!M91","v":0},{"$f":"TypeListTemplate!N91","v":0},{"$f":"TypeListTemplate!O91","v":0},{"$f":"TypeListTemplate!P91","v":0},{"$f":"TypeListTemplate!Q91","v":0}]
[{"$f":"TypeListTemplate!A92","v":0},{"$f":"TypeListTemplate!B92","v":0},{"$f":"TypeListTemplate!C92","v":0},{"$f":"TypeListTemplate!D92","v":0},{"$f":"TypeListTemplate!E92","v":0},{"$f":"TypeListTemplate!F92","v":0},{"$f":"TypeListTemplate!G92","v":0},{"$f":"TypeListTemplate!H92","v":0},{"$f":"TypeListTemplate!I92","v":0},{"$f":"TypeListTemplate!J92","v":0},{"$f":"TypeListTemplate!K92","v":0},{"$f":"TypeListTemplate!L92","v":0},{"$f":"TypeListTemplate!M92","v":0},{"$f":"TypeListTemplate!N92","v":0},{"$f":"TypeListTemplate!O92","v":0},{"$f":"TypeListTemplate!P92","v":0},{"$f":"TypeListTemplate!Q92","v":0}]
[{"$f":"TypeListTemplate!A93","v":0},{"$f":"TypeListTemplate!B93","v":0},{"$f":"TypeListTemplate!C93","v":0},{"$f":"TypeListTemplate!D93","v":0},{"$f":"TypeListTemplate!E93","v":0},{"$f":"TypeListTemplate!F93","v":0},{"$f":"TypeListTemplate!G93","v":0},{"$f":"TypeListTemplate!H93","v":0},{"$f":"TypeListTemplate!I93","v":0},{"$f":"TypeListTemplate!J93","v":0},{"$f":"TypeListTemplate!K93","v":0},{"$f":"TypeListTemplate!L93","v":0},{"$f":"TypeListTemplate!M93","v":0},{"$f":"TypeListTemplate!N93","v":0},{"$f":"TypeListTemplate!O93","v":0},{"$f":"TypeListTemplate!P93","v":0},{"$f":"TypeListTemplate!Q93","v":0}]
[{"$f":"TypeListTemplate!A94","v":0},{"$f":"TypeListTemplate!B94","v":0},{"$f":"TypeListTemplate!C94","v":0},{"$f":"TypeListTemplate!D94","v":0},{"$f":"TypeListTemplate!E94","v":0},{"$f":"TypeListTemplate!F94","v":0},{"$f":"TypeListTemplate!G94","v":0},{"$f":"TypeListTemplate!H94","v":0},{"$f":"TypeListTemplate!I94","v":0},{"$f":"TypeListTemplate!J94","v":0},{"$f":"TypeListTemplate!K94","v":0},{"$f":"TypeListTemplate!L94","v":0},{"$f":"TypeListTemplate!M94","v":0},{"$f":"TypeListTemplate!N94","v":0},{"$f":"TypeListTemplate!O94","v":0},{"$f":"TypeListTemplate!P94","v":0},{"$f":"TypeListTemplate!Q94","v":0}]
[{"$f":"TypeListTemplate!A95","v":0},{"$f":"TypeListTemplate!B95","v":0},{"$f":"TypeListTemplate!C95","v":0},{"$f":"TypeListTemplate!D95","v":0},{"$f":"TypeListTemplate!E95","v":0},{"$f":"TypeListTemplate!F95","v":0},{"$f":"TypeListTemplate!G95","v":0},{"$f":"TypeListTemplate!H95","v":0},{"$f":"TypeListTemplate!I95","v":0},{"$f":"TypeListTemplate!J95","v":0},{"$f":"TypeListTemplate!K95","v":0},{"$f":"TypeListTemplate!L95","v":0},{"$f":"TypeListTemplate!M95","v":0},{"$f":"TypeListTemplate!N95","v":0},{"$f":"TypeListTemplate!O95","v":0},{"$f":"TypeListTemplate!P95","v":0},{"$f":"TypeListTemplate!Q95","v":0}]

{"sheet":"ACS150","index":6,"n_rows":95,"n_cols":17,"rows_kept":95,"cut":false,"hidden":true,"merged":[]}
["Typecode","Prod.class",null,"Voltage range 1",null,"Voltage range 2 (1-ph)",null,"Voltage range 2",null,"Voltage range 3",null,"Voltage range 4.6",null,"Voltage range 5",null,"Voltage range 7/6"]
[{"$f":"VLOOKUP(DriveSel!E20,C8:Y71,DriveSel!D18)","v":0},{"$f":"VLOOKUP(#REF!,C8:X70,7)","v":{"$error":"#REF!"}},"non-US (50Hz)"," 115 V (1-ph)",null," 230 V (1-ph)",null," 230 V (3-ph)",null," 400 V",null," 460 V",null," 500 V",null," 690 V"]
["Col.ordinal","Col.ordinal"]
[null,null,"Alternatives:","115 V 1-ph",null,"200/208/230/240 V 1-ph",null,"200/208/230/240 V 3-ph",null,"380/400/415 V",null,"440/460/480 V",null,"500 V",null,"525/550/575/600/660/690 V"]
[{"$f":"TypeListTemplate!A5","v":"Motor Power"},{"$f":"TypeListTemplate!B5","v":"Motor"},{"$f":"TypeListTemplate!C5","v":0},{"$f":"TypeListTemplate!D5","v":"Drive type"},{"$f":"TypeListTemplate!E5","v":0},{"$f":"TypeListTemplate!F5","v":"Drive type"},{"$f":"TypeListTemplate!G5","v":0},{"$f":"TypeListTemplate!H5","v":"Drive type"},{"$f":"TypeListTemplate!I5","v":0},{"$f":"TypeListTemplate!J5","v":"Drive type"},{"$f":"TypeListTemplate!K5","v":0},{"$f":"TypeListTemplate!L5","v":"Drive type"},{"$f":"TypeListTemplate!M5","v":0},{"$f":"TypeListTemplate!N5","v":"Drive type"},{"$f":"TypeListTemplate!O5","v":0},{"$f":"TypeListTemplate!P5","v":"Drive type"},{"$f":"TypeListTemplate!Q5","v":0}]
[{"$f":"TypeListTemplate!A6","v":"Hp"},{"$f":"TypeListTemplate!B6","v":"power kW"}]
[{"$f":"TypeListTemplate!A7","v":0},{"$f":"TypeListTemplate!B7","v":"Column Ordinal ->"},{"$f":"TypeListTemplate!C7","v":1},{"$f":"TypeListTemplate!D7","v":2},{"$f":"TypeListTemplate!E7","v":3},{"$f":"TypeListTemplate!F7","v":4},{"$f":"TypeListTemplate!G7","v":5},{"$f":"TypeListTemplate!H7","v":6},{"$f":"TypeListTemplate!I7","v":7},{"$f":"TypeListTemplate!J7","v":8},{"$f":"TypeListTemplate!K7","v":9},{"$f":"TypeListTemplate!L7","v":10},{"$f":"TypeListTemplate!M7","v":11},{"$f":"TypeListTemplate!N7","v":12},{"$f":"TypeListTemplate!O7","v":13},{"$f":"TypeListTemplate!P7","v":14},{"$f":"TypeListTemplate!Q7","v":15}]
[{"$f":"TypeListTemplate!A8","v":0},{"$f":"TypeListTemplate!B8","v":0},{"$f":"TypeListTemplate!C8","v":0}]
[{"$f":"TypeListTemplate!A9","v":7.3756202226096287E-2},{"$f":"TypeListTemplate!B9","v":5.5E-2},{"$f":"TypeListTemplate!C9","v":0.01}]
[{"$f":"TypeListTemplate!A10","v":0.12069196727906664},{"$f":"TypeListTemplate!B10","v":0.09},{"$f":"TypeListTemplate!C10","v":6.5000000000000002E-2}]
[{"$f":"TypeListTemplate!A11","v":0.16092262303875551},{"$f":"TypeListTemplate!B11","v":0.12},{"$f":"TypeListTemplate!C11","v":9.9999999999999992E-2},null,null,"ACS150-01E-02A4-2",null,"ACS150-03E-02A4-2",null,"ACS150-03E-01A2-4",null,"ACS150-03E-01A2-4"]
[{"$f":"TypeListTemplate!A12","v":0.24138393455813328},{"$f":"TypeListTemplate!B12","v":0.18},{"$f":"TypeListTemplate!C12","v":0.13},null,null,"ACS150-01E-02A4-2",null,"ACS150-03E-02A4-2",null,"ACS150-03E-01A2-4",null,"ACS150-03E-01A2-4"]
[{"$f":"TypeListTemplate!A13","v":0.49617808770282951},{"$f":"TypeListTemplate!B13","v":0.37},{"$f":"TypeListTemplate!C13","v":0.19},null,null,"ACS150-01E-02A4-2",null,"ACS150-03E-02A4-2",null,"ACS150-03E-01A2-4",null,"ACS150-03E-01A2-4"]
[{"$f":"TypeListTemplate!A14","v":0.7375620222609629},{"$f":"TypeListTemplate!B14","v":0.55000000000000004},{"$f":"TypeListTemplate!C14","v":0.38},null,null,"ACS150-01E-02A4-2",null,"ACS150-03E-03A5-2",null,"ACS150-03E-01A9-4",null,"ACS150-03E-01A9-4"]
[{"$f":"TypeListTemplate!A15","v":1.0057663939922221},{"$f":"TypeListTemplate!B15","v":0.75},{"$f":"TypeListTemplate!C15","v":0.56000000000000005},null,null,"ACS150-01E-04A7-2",null,"ACS150-03E-04A7-2",null,"ACS150-03E-02A4-4",null,"ACS150-03E-02A4-4"]
[{"$f":"TypeListTemplate!A16","v":1.4751240445219258},{"$f":"TypeListTemplate!B16","v":1.1000000000000001},{"$f":"TypeListTemplate!C16","v":0.76},null,null,"ACS150-01E-04A7-2",null,"ACS150-03E-06A7-2",null,"ACS150-03E-03A3-4",null,"ACS150-03E-03A3-4"]
[{"$f":"TypeListTemplate!A17","v":2.0115327879844442},{"$f":"TypeListTemplate!B17","v":1.5},{"$f":"TypeListTemplate!C17","v":1.1100000000000001},null,null,"ACS150-01E-06A7-2",null,"ACS150-03E-07A5-2",null,"ACS150-03E-04A1-4",null,"ACS150-03E-04A1-4"]
[{"$f":"TypeListTemplate!A18","v":2.9502480890438516},{"$f":"TypeListTemplate!B18","v":2.2000000000000002},{"$f":"TypeListTemplate!C18","v":1.51},null,null,"ACS150-01E-07A5-2",null,"ACS150-03E-09A8-2",null,"ACS150-03E-05A6-4",null,"ACS150-03E-05A6-4"]
[{"$f":"TypeListTemplate!A19","v":4.0230655759688885},{"$f":"TypeListTemplate!B19","v":3},{"$f":"TypeListTemplate!C19","v":2.21},null,null,"ACS150-01E-09A8-2",null,null,null,"ACS150-03E-07A3-4",null,"ACS150-03E-07A3-4"]
[{"$f":"TypeListTemplate!A20","v":5},{"$f":"TypeListTemplate!B20","v":3.7285000000000004},{"$f":"TypeListTemplate!C20","v":3.01},null,null,null,null,null,null,"ACS150-03E-08A8-4",null,"ACS150-03E-08A8-4"]
[{"$f":"TypeListTemplate!A21","v":5.3640874346251843},{"$f":"TypeListTemplate!B21","v":4},{"$f":"TypeListTemplate!C21","v":3.7385000000000002},null,null,null,null,null,null,"ACS150-03E-08A8-4",null,"ACS150-03E-08A8-4"]
[{"$f":"TypeListTemplate!A22","v":7.3756202226096281},{"$f":"TypeListTemplate!B22","v":5.5},{"$f":"TypeListTemplate!C22","v":4.01}]
[{"$f":"TypeListTemplate!A23","v":10.05766393992222},{"$f":"TypeListTemplate!B23","v":7.5},{"$f":"TypeListTemplate!C23","v":5.51}]
[{"$f":"TypeListTemplate!A24","v":14.751240445219256},{"$f":"TypeListTemplate!B24","v":11},{"$f":"TypeListTemplate!C24","v":7.51}]
[{"$f":"TypeListTemplate!A25","v":20.11532787984444},{"$f":"TypeListTemplate!B25","v":15},{"$f":"TypeListTemplate!C25","v":11.01}]
[{"$f":"TypeListTemplate!A26","v":24.808904385141478},{"$f":"TypeListTemplate!B26","v":18.5},{"$f":"TypeListTemplate!C26","v":15.01}]
[{"$f":"TypeListTemplate!A27","v":29.502480890438513},{"$f":"TypeListTemplate!B27","v":22},{"$f":"TypeListTemplate!C27","v":18.510000000000002}]
[{"$f":"TypeListTemplate!A28","v":40.230655759688879},{"$f":"TypeListTemplate!B28","v":30},{"$f":"TypeListTemplate!C28","v":22.01}]
[{"$f":"TypeListTemplate!A29","v":49.617808770282956},{"$f":"TypeListTemplate!B29","v":37},{"$f":"TypeListTemplate!C29","v":30.01}]
[{"$f":"TypeListTemplate!A30","v":60.345983639533323},{"$f":"TypeListTemplate!B30","v":45},{"$f":"TypeListTemplate!C30","v":37.01}]
[{"$f":"TypeListTemplate!A31","v":73.756202226096278},{"$f":"TypeListTemplate!B31","v":55},{"$f":"TypeListTemplate!C31","v":45.01}]
[{"$f":"TypeListTemplate!A32","v":100.5766393992222},{"$f":"TypeListTemplate!B32","v":75},{"$f":"TypeListTemplate!C32","v":55.01}]
[{"$f":"TypeListTemplate!A33","v":120.69196727906665},{"$f":"TypeListTemplate!B33","v":90},{"$f":"TypeListTemplate!C33","v":75.010000000000005}]
[{"$f":"TypeListTemplate!A34","v":147.51240445219256},{"$f":"TypeListTemplate!B34","v":110},{"$f":"TypeListTemplate!C34","v":90.01}]
[{"$f":"TypeListTemplate!A35","v":177.01488534263109},{"$f":"TypeListTemplate!B35","v":132},{"$f":"TypeListTemplate!C35","v":110.01}]
[{"$f":"TypeListTemplate!A36","v":200},{"$f":"TypeListTemplate!B36","v":149.14000000000001},{"$f":"TypeListTemplate!C36","v":132.01}]
[{"$f":"TypeListTemplate!A37","v":214.56349738500737},{"$f":"TypeListTemplate!B37","v":160},{"$f":"TypeListTemplate!C37","v":149.15}]
[{"$f":"TypeListTemplate!A38","v":250},{"$f":"TypeListTemplate!B38","v":186.42500000000001},{"$f":"TypeListTemplate!C38","v":160.01}]
[{"$f":"TypeListTemplate!A39","v":268.20437173125919},{"$f":"TypeListTemplate!B39","v":200},{"$f":"TypeListTemplate!C39","v":186.435}]
[{"$f":"TypeListTemplate!A40","v":300},{"$f":"TypeListTemplate!B40","v":223.71},{"$f":"TypeListTemplate!C40","v":200.01}]
[{"$f":"TypeListTemplate!A41","v":335.255464664074},{"$f":"TypeListTemplate!B41","v":250},{"$f":"TypeListTemplate!C41","v":223.72}]
[{"$f":"TypeListTemplate!A42","v":400},{"$f":"TypeListTemplate!B42","v":298.28000000000003},{"$f":"TypeListTemplate!C42","v":250.01}]
[{"$f":"TypeListTemplate!A43","v":422.42188547673328},{"$f":"TypeListTemplate!B43","v":315},{"$f":"TypeListTemplate!C43","v":298.29000000000002}]
[{"$f":"TypeListTemplate!A44","v":476.06275982298507},{"$f":"TypeListTemplate!B44","v":355},{"$f":"TypeListTemplate!C44","v":315.01}]
[{"$f":"TypeListTemplate!A45","v":536.40874346251837},{"$f":"TypeListTemplate!B45","v":400},{"$f":"TypeListTemplate!C45","v":355.01}]
[{"$f":"TypeListTemplate!A46","v":603.45983639533324},{"$f":"TypeListTemplate!B46","v":450},{"$f":"TypeListTemplate!C46","v":400.01}]
[{"$f":"TypeListTemplate!A47","v":670.51092932814799},{"$f":"TypeListTemplate!B47","v":500},{"$f":"TypeListTemplate!C47","v":450.01}]
[{"$f":"TypeListTemplate!A48","v":750.97224084752577},{"$f":"TypeListTemplate!B48","v":560},{"$f":"TypeListTemplate!C48","v":500.01}]
[{"$f":"TypeListTemplate!A49","v":844.84377095346656},{"$f":"TypeListTemplate!B49","v":630},{"$f":"TypeListTemplate!C49","v":560.01}]
[{"$f":"TypeListTemplate!A50","v":952.12551964597014},{"$f":"TypeListTemplate!B50","v":710},{"$f":"TypeListTemplate!C50","v":630.01}]
[{"$f":"TypeListTemplate!A51","v":1072.8174869250367},{"$f":"TypeListTemplate!B51","v":800},{"$f":"TypeListTemplate!C51","v":710.01}]
[{"$f":"TypeListTemplate!A52","v":1206.9196727906665},{"$f":"TypeListTemplate!B52","v":900},{"$f":"TypeListTemplate!C52","v":800.01}]
[{"$f":"TypeListTemplate!A53","v":1341.021858656296},{"$f":"TypeListTemplate!B53","v":1000},{"$f":"TypeListTemplate!C53","v":900.01}]
[{"$f":"TypeListTemplate!A54","v":1501.9444816950515},{"$f":"TypeListTemplate!B54","v":1120},{"$f":"TypeListTemplate!C54","v":1000.01}]
[{"$f":"TypeListTemplate!A55","v":1676.27732332037},{"$f":"TypeListTemplate!B55","v":1250},{"$f":"TypeListTemplate!C55","v":1120.01}]
[{"$f":"TypeListTemplate!A56","v":1877.4306021188145},{"$f":"TypeListTemplate!B56","v":1400},{"$f":"TypeListTemplate!C56","v":1250.01}]
[{"$f":"TypeListTemplate!A57","v":2145.6349738500735},{"$f":"TypeListTemplate!B57","v":1600},{"$f":"TypeListTemplate!C57","v":1400.01}]
[{"$f":"TypeListTemplate!A58","v":2346.7882526485182},{"$f":"TypeListTemplate!B58","v":1750},{"$f":"TypeListTemplate!C58","v":1600.01}]
[{"$f":"TypeListTemplate!A59","v":2413.839345581333},{"$f":"TypeListTemplate!B59","v":1800},{"$f":"TypeListTemplate!C59","v":1750.01}]
[{"$f":"TypeListTemplate!A60","v":2682.043717312592},{"$f":"TypeListTemplate!B60","v":2000},{"$f":"TypeListTemplate!C60","v":1800.01}]
[{"$f":"TypeListTemplate!A61","v":2950.2480890438515},{"$f":"TypeListTemplate!B61","v":2200},{"$f":"TypeListTemplate!C61","v":2000.01}]
[{"$f":"TypeListTemplate!A62","v":3017.2991819766662},{"$f":"TypeListTemplate!B62","v":2250},{"$f":"TypeListTemplate!C62","v":2200.0100000000002}]
[{"$f":"TypeListTemplate!A63","v":3084.350274909481},{"$f":"TypeListTemplate!B63","v":2300},{"$f":"TypeListTemplate!C63","v":2250.0100000000002}]
[{"$f":"TypeListTemplate!A64","v":3352.55464664074},{"$f":"TypeListTemplate!B64","v":2500},{"$f":"TypeListTemplate!C64","v":2300.0100000000002}]
[{"$f":"TypeListTemplate!A65","v":3754.861204237629},{"$f":"TypeListTemplate!B65","v":2800},{"$f":"TypeListTemplate!C65","v":2500.0100000000002}]
[{"$f":"TypeListTemplate!A66","v":4224.2188547673322},{"$f":"TypeListTemplate!B66","v":3150},{"$f":"TypeListTemplate!C66","v":2800.01}]
[{"$f":"TypeListTemplate!A67","v":4760.6275982298512},{"$f":"TypeListTemplate!B67","v":3550},{"$f":"TypeListTemplate!C67","v":3150.01}]
[{"$f":"TypeListTemplate!A68","v":5364.087434625184},{"$f":"TypeListTemplate!B68","v":4000},{"$f":"TypeListTemplate!C68","v":3550.01}]
[{"$f":"TypeListTemplate!A69","v":6034.5983639533324},{"$f":"TypeListTemplate!B69","v":4500},{"$f":"TypeListTemplate!C69","v":4000.01}]
[{"$f":"TypeListTemplate!A70","v":6705.1092932814799},{"$f":"TypeListTemplate!B70","v":5000},{"$f":"TypeListTemplate!C70","v":4500.01}]
[{"$f":"TypeListTemplate!A71","v":0},{"$f":"TypeListTemplate!B71","v":999999999},{"$f":"TypeListTemplate!C71","v":5000.01}]
[{"$f":"TypeListTemplate!A72","v":0},{"$f":"TypeListTemplate!B72","v":0},{"$f":"TypeListTemplate!C72","v":0}]
[{"$f":"TypeListTemplate!A73","v":0},{"$f":"TypeListTemplate!B73","v":0},{"$f":"TypeListTemplate!C73","v":0},{"$f":"TypeListTemplate!D73","v":"Drive type"},{"$f":"TypeListTemplate!E73","v":0},{"$f":"TypeListTemplate!F73","v":"Drive type"},{"$f":"TypeListTemplate!G73","v":0},{"$f":"TypeListTemplate!H73","v":"Drive type"},{"$f":"TypeListTemplate!I73","v":0},{"$f":"TypeListTemplate!J73","v":"Drive type"},{"$f":"TypeListTemplate!K73","v":0},{"$f":"TypeListTemplate!L73","v":"Drive type"},{"$f":"TypeListTemplate!M73","v":0},{"$f":"TypeListTemplate!N73","v":"Drive type"},{"$f":"TypeListTemplate!O73","v":0},{"$f":"TypeListTemplate!P73","v":"Drive type"},{"$f":"TypeListTemplate!Q73","v":0}]
[{"$f":"TypeListTemplate!A74","v":0},{"$f":"TypeListTemplate!B74","v":0},{"$f":"TypeListTemplate!C74","v":0},{"$f":"TypeListTemplate!D74","v":" 115 V (1-ph)"},{"$f":"TypeListTemplate!E74","v":0},{"$f":"TypeListTemplate!F74","v":" 230 V (1-ph)"},{"$f":"TypeListTemplate!G74","v":0},{"$f":"TypeListTemplate!H74","v":" 230 V (3-ph)"},{"$f":"TypeListTemplate!I74","v":0},{"$f":"TypeListTemplate!J74","v":" 400 V"},{"$f":"TypeListTemplate!K74","v":0},{"$f":"TypeListTemplate!L74","v":" 460 V"},{"$f":"TypeListTemplate!M74","v":0},{"$f":"TypeListTemplate!N74","v":" 500 V"},{"$f":"TypeListTemplate!O74","v":0},{"$f":"TypeListTemplate!P74","v":" 690 V"},{"$f":"TypeListTemplate!Q74","v":0}]
[{"$f":"TypeListTemplate!A75","v":0},{"$f":"TypeListTemplate!B75","v":0},{"$f":"TypeListTemplate!C75","v":0},{"$f":"TypeListTemplate!D75","v":0},{"$f":"TypeListTemplate!E75","v":0},{"$f":"TypeListTemplate!F75","v":0},{"$f":"TypeListTemplate!G75","v":0},{"$f":"TypeListTemplate!H75","v":0},{"$f":"TypeListTemplate!I75","v":0},{"$f":"TypeListTemplate!J75","v":0},{"$f":"TypeListTemplate!K75","v":0},{"$f":"TypeListTemplate!L75","v":0},{"$f":"TypeListTemplate!M75","v":0},{"$f":"TypeListTemplate!N75","v":0},{"$f":"TypeListTemplate!O75","v":0},{"$f":"TypeListTemplate!P75","v":0},{"$f":"TypeListTemplate!Q75","v":0}]
[{"$f":"TypeListTemplate!A76","v":0},{"$f":"TypeListTemplate!B76","v":0},{"$f":"TypeListTemplate!C76","v":0},{"$f":"TypeListTemplate!D76","v":0},{"$f":"TypeListTemplate!E76","v":0},{"$f":"TypeListTemplate!F76","v":0},{"$f":"TypeListTemplate!G76","v":0},{"$f":"TypeListTemplate!H76","v":0},{"$f":"TypeListTemplate!I76","v":0},{"$f":"TypeListTemplate!J76","v":0},{"$f":"TypeListTemplate!K76","v":0},{"$f":"TypeListTemplate!L76","v":0},{"$f":"TypeListTemplate!M76","v":0},{"$f":"TypeListTemplate!N76","v":0},{"$f":"TypeListTemplate!O76","v":0},{"$f":"TypeListTemplate!P76","v":0},{"$f":"TypeListTemplate!Q76","v":0}]
[{"$f":"TypeListTemplate!A77","v":0},{"$f":"TypeListTemplate!B77","v":0},{"$f":"TypeListTemplate!C77","v":0},{"$f":"TypeListTemplate!D77","v":0},{"$f":"TypeListTemplate!E77","v":0},{"$f":"TypeListTemplate!F77","v":0},{"$f":"TypeListTemplate!G77","v":0},{"$f":"TypeListTemplate!H77","v":0},{"$f":"TypeListTemplate!I77","v":0},{"$f":"TypeListTemplate!J77","v":0},{"$f":"TypeListTemplate!K77","v":0},{"$f":"TypeListTemplate!L77","v":0},{"$f":"TypeListTemplate!M77","v":0},{"$f":"TypeListTemplate!N77","v":0},{"$f":"TypeListTemplate!O77","v":0},{"$f":"TypeListTemplate!P77","v":0},{"$f":"TypeListTemplate!Q77","v":0}]
[{"$f":"TypeListTemplate!A78","v":0},{"$f":"TypeListTemplate!B78","v":0},{"$f":"TypeListTemplate!C78","v":0},{"$f":"TypeListTemplate!D78","v":0},{"$f":"TypeListTemplate!E78","v":0},{"$f":"TypeListTemplate!F78","v":0},{"$f":"TypeListTemplate!G78","v":0},{"$f":"TypeListTemplate!H78","v":0},{"$f":"TypeListTemplate!I78","v":0},{"$f":"TypeListTemplate!J78","v":0},{"$f":"TypeListTemplate!K78","v":0},{"$f":"TypeListTemplate!L78","v":0},{"$f":"TypeListTemplate!M78","v":0},{"$f":"TypeListTemplate!N78","v":0},{"$f":"TypeListTemplate!O78","v":0},{"$f":"TypeListTemplate!P78","v":0},{"$f":"TypeListTemplate!Q78","v":0}]
[{"$f":"TypeListTemplate!A79","v":0},{"$f":"TypeListTemplate!B79","v":0},{"$f":"TypeListTemplate!C79","v":0},{"$f":"TypeListTemplate!D79","v":0},{"$f":"TypeListTemplate!E79","v":0},{"$f":"TypeListTemplate!F79","v":0},{"$f":"TypeListTemplate!G79","v":0},{"$f":"TypeListTemplate!H79","v":0},{"$f":"TypeListTemplate!I79","v":0},{"$f":"TypeListTemplate!J79","v":0},{"$f":"TypeListTemplate!K79","v":0},{"$f":"TypeListTemplate!L79","v":0},{"$f":"TypeListTemplate!M79","v":0},{"$f":"TypeListTemplate!N79","v":0},{"$f":"TypeListTemplate!O79","v":0},{"$f":"TypeListTemplate!P79","v":0},{"$f":"TypeListTemplate!Q79","v":0}]
[{"$f":"TypeListTemplate!A80","v":0},{"$f":"TypeListTemplate!B80","v":0},{"$f":"TypeListTemplate!C80","v":0},{"$f":"TypeListTemplate!D80","v":0},{"$f":"TypeListTemplate!E80","v":0},{"$f":"TypeListTemplate!F80","v":0},{"$f":"TypeListTemplate!G80","v":0},{"$f":"TypeListTemplate!H80","v":0},{"$f":"TypeListTemplate!I80","v":0},{"$f":"TypeListTemplate!J80","v":0},{"$f":"TypeListTemplate!K80","v":0},{"$f":"TypeListTemplate!L80","v":0},{"$f":"TypeListTemplate!M80","v":0},{"$f":"TypeListTemplate!N80","v":0},{"$f":"TypeListTemplate!O80","v":0},{"$f":"TypeListTemplate!P80","v":0},{"$f":"TypeListTemplate!Q80","v":0}]
[{"$f":"TypeListTemplate!A81","v":0},{"$f":"TypeListTemplate!B81","v":0},{"$f":"TypeListTemplate!C81","v":0},{"$f":"TypeListTemplate!D81","v":0},{"$f":"TypeListTemplate!E81","v":0},{"$f":"TypeListTemplate!F81","v":0},{"$f":"TypeListTemplate!G81","v":0},{"$f":"TypeListTemplate!H81","v":0},{"$f":"TypeListTemplate!I81","v":0},{"$f":"TypeListTemplate!J81","v":0},{"$f":"TypeListTemplate!K81","v":0},{"$f":"TypeListTemplate!L81","v":0},{"$f":"TypeListTemplate!M81","v":0},{"$f":"TypeListTemplate!N81","v":0},{"$f":"TypeListTemplate!O81","v":0},{"$f":"TypeListTemplate!P81","v":0},{"$f":"TypeListTemplate!Q81","v":0}]
[{"$f":"TypeListTemplate!A82","v":0},{"$f":"TypeListTemplate!B82","v":0},{"$f":"TypeListTemplate!C82","v":0},{"$f":"TypeListTemplate!D82","v":0},{"$f":"TypeListTemplate!E82","v":0},{"$f":"TypeListTemplate!F82","v":0},{"$f":"TypeListTemplate!G82","v":0},{"$f":"TypeListTemplate!H82","v":0},{"$f":"TypeListTemplate!I82","v":0},{"$f":"TypeListTemplate!J82","v":0},{"$f":"TypeListTemplate!K82","v":0},{"$f":"TypeListTemplate!L82","v":0},{"$f":"TypeListTemplate!M82","v":0},{"$f":"TypeListTemplate!N82","v":0},{"$f":"TypeListTemplate!O82","v":0},{"$f":"TypeListTemplate!P82","v":0},{"$f":"TypeListTemplate!Q82","v":0}]
[{"$f":"TypeListTemplate!A83","v":0},{"$f":"TypeListTemplate!B83","v":0},{"$f":"TypeListTemplate!C83","v":0},{"$f":"TypeListTemplate!D83","v":0},{"$f":"TypeListTemplate!E83","v":0},{"$f":"TypeListTemplate!F83","v":0},{"$f":"TypeListTemplate!G83","v":0},{"$f":"TypeListTemplate!H83","v":0},{"$f":"TypeListTemplate!I83","v":0},{"$f":"TypeListTemplate!J83","v":0},{"$f":"TypeListTemplate!K83","v":0},{"$f":"TypeListTemplate!L83","v":0},{"$f":"TypeListTemplate!M83","v":0},{"$f":"TypeListTemplate!N83","v":0},{"$f":"TypeListTemplate!O83","v":0},{"$f":"TypeListTemplate!P83","v":0},{"$f":"TypeListTemplate!Q83","v":0}]
[{"$f":"TypeListTemplate!A84","v":0},{"$f":"TypeListTemplate!B84","v":0},{"$f":"TypeListTemplate!C84","v":0},{"$f":"TypeListTemplate!D84","v":0},{"$f":"TypeListTemplate!E84","v":0},{"$f":"TypeListTemplate!F84","v":0},{"$f":"TypeListTemplate!G84","v":0},{"$f":"TypeListTemplate!H84","v":0},{"$f":"TypeListTemplate!I84","v":0},{"$f":"TypeListTemplate!J84","v":0},{"$f":"TypeListTemplate!K84","v":0},{"$f":"TypeListTemplate!L84","v":0},{"$f":"TypeListTemplate!M84","v":0},{"$f":"TypeListTemplate!N84","v":0},{"$f":"TypeListTemplate!O84","v":0},{"$f":"TypeListTemplate!P84","v":0},{"$f":"TypeListTemplate!Q84","v":0}]
[{"$f":"TypeListTemplate!A85","v":0},{"$f":"TypeListTemplate!B85","v":0},{"$f":"TypeListTemplate!C85","v":0},{"$f":"TypeListTemplate!D85","v":0},{"$f":"TypeListTemplate!E85","v":0},{"$f":"TypeListTemplate!F85","v":0},{"$f":"TypeListTemplate!G85","v":0},{"$f":"TypeListTemplate!H85","v":0},{"$f":"TypeListTemplate!I85","v":0},{"$f":"TypeListTemplate!J85","v":0},{"$f":"TypeListTemplate!K85","v":0},{"$f":"TypeListTemplate!L85","v":0},{"$f":"TypeListTemplate!M85","v":0},{"$f":"TypeListTemplate!N85","v":0},{"$f":"TypeListTemplate!O85","v":0},{"$f":"TypeListTemplate!P85","v":0},{"$f":"TypeListTemplate!Q85","v":0}]
[{"$f":"TypeListTemplate!A86","v":0},{"$f":"TypeListTemplate!B86","v":0},{"$f":"TypeListTemplate!C86","v":0},{"$f":"TypeListTemplate!D86","v":0},{"$f":"TypeListTemplate!E86","v":0},{"$f":"TypeListTemplate!F86","v":0},{"$f":"TypeListTemplate!G86","v":0},{"$f":"TypeListTemplate!H86","v":0},{"$f":"TypeListTemplate!I86","v":0},{"$f":"TypeListTemplate!J86","v":0},{"$f":"TypeListTemplate!K86","v":0},{"$f":"TypeListTemplate!L86","v":0},{"$f":"TypeListTemplate!M86","v":0},{"$f":"TypeListTemplate!N86","v":0},{"$f":"TypeListTemplate!O86","v":0},{"$f":"TypeListTemplate!P86","v":0},{"$f":"TypeListTemplate!Q86","v":0}]
[{"$f":"TypeListTemplate!A87","v":0},{"$f":"TypeListTemplate!B87","v":0},{"$f":"TypeListTemplate!C87","v":0},{"$f":"TypeListTemplate!D87","v":0},{"$f":"TypeListTemplate!E87","v":0},{"$f":"TypeListTemplate!F87","v":0},{"$f":"TypeListTemplate!G87","v":0},{"$f":"TypeListTemplate!H87","v":0},{"$f":"TypeListTemplate!I87","v":0},{"$f":"TypeListTemplate!J87","v":0},{"$f":"TypeListTemplate!K87","v":0},{"$f":"TypeListTemplate!L87","v":0},{"$f":"TypeListTemplate!M87","v":0},{"$f":"TypeListTemplate!N87","v":0},{"$f":"TypeListTemplate!O87","v":0},{"$f":"TypeListTemplate!P87","v":0},{"$f":"TypeListTemplate!Q87","v":0}]
[{"$f":"TypeListTemplate!A88","v":0},{"$f":"TypeListTemplate!B88","v":0},{"$f":"TypeListTemplate!C88","v":0},{"$f":"TypeListTemplate!D88","v":0},{"$f":"TypeListTemplate!E88","v":0},{"$f":"TypeListTemplate!F88","v":0},{"$f":"TypeListTemplate!G88","v":0},{"$f":"TypeListTemplate!H88","v":0},{"$f":"TypeListTemplate!I88","v":0},{"$f":"TypeListTemplate!J88","v":0},{"$f":"TypeListTemplate!K88","v":0},{"$f":"TypeListTemplate!L88","v":0},{"$f":"TypeListTemplate!M88","v":0},{"$f":"TypeListTemplate!N88","v":0},{"$f":"TypeListTemplate!O88","v":0},{"$f":"TypeListTemplate!P88","v":0},{"$f":"TypeListTemplate!Q88","v":0}]
[{"$f":"TypeListTemplate!A89","v":0},{"$f":"TypeListTemplate!B89","v":0},{"$f":"TypeListTemplate!C89","v":0},{"$f":"TypeListTemplate!D89","v":0},{"$f":"TypeListTemplate!E89","v":0},{"$f":"TypeListTemplate!F89","v":0},{"$f":"TypeListTemplate!G89","v":0},{"$f":"TypeListTemplate!H89","v":0},{"$f":"TypeListTemplate!I89","v":0},{"$f":"TypeListTemplate!J89","v":0},{"$f":"TypeListTemplate!K89","v":0},{"$f":"TypeListTemplate!L89","v":0},{"$f":"TypeListTemplate!M89","v":0},{"$f":"TypeListTemplate!N89","v":0},{"$f":"TypeListTemplate!O89","v":0},{"$f":"TypeListTemplate!P89","v":0},{"$f":"TypeListTemplate!Q89","v":0}]
[{"$f":"TypeListTemplate!A90","v":0},{"$f":"TypeListTemplate!B90","v":0},{"$f":"TypeListTemplate!C90","v":0},{"$f":"TypeListTemplate!D90","v":0},{"$f":"TypeListTemplate!E90","v":0},{"$f":"TypeListTemplate!F90","v":0},{"$f":"TypeListTemplate!G90","v":0},{"$f":"TypeListTemplate!H90","v":0},{"$f":"TypeListTemplate!I90","v":0},{"$f":"TypeListTemplate!J90","v":0},{"$f":"TypeListTemplate!K90","v":0},{"$f":"TypeListTemplate!L90","v":0},{"$f":"TypeListTemplate!M90","v":0},{"$f":"TypeListTemplate!N90","v":0},{"$f":"TypeListTemplate!O90","v":0},{"$f":"TypeListTemplate!P90","v":0},{"$f":"TypeListTemplate!Q90","v":0}]
[{"$f":"TypeListTemplate!A91","v":0},{"$f":"TypeListTemplate!B91","v":0},{"$f":"TypeListTemplate!C91","v":0},{"$f":"TypeListTemplate!D91","v":0},{"$f":"TypeListTemplate!E91","v":0},{"$f":"TypeListTemplate!F91","v":0},{"$f":"TypeListTemplate!G91","v":0},{"$f":"TypeListTemplate!H91","v":0},{"$f":"TypeListTemplate!I91","v":0},{"$f":"TypeListTemplate!J91","v":0},{"$f":"TypeListTemplate!K91","v":0},{"$f":"TypeListTemplate!L91","v":0},{"$f":"TypeListTemplate!M91","v":0},{"$f":"TypeListTemplate!N91","v":0},{"$f":"TypeListTemplate!O91","v":0},{"$f":"TypeListTemplate!P91","v":0},{"$f":"TypeListTemplate!Q91","v":0}]
[{"$f":"TypeListTemplate!A92","v":0},{"$f":"TypeListTemplate!B92","v":0},{"$f":"TypeListTemplate!C92","v":0},{"$f":"TypeListTemplate!D92","v":0},{"$f":"TypeListTemplate!E92","v":0},{"$f":"TypeListTemplate!F92","v":0},{"$f":"TypeListTemplate!G92","v":0},{"$f":"TypeListTemplate!H92","v":0},{"$f":"TypeListTemplate!I92","v":0},{"$f":"TypeListTemplate!J92","v":0},{"$f":"TypeListTemplate!K92","v":0},{"$f":"TypeListTemplate!L92","v":0},{"$f":"TypeListTemplate!M92","v":0},{"$f":"TypeListTemplate!N92","v":0},{"$f":"TypeListTemplate!O92","v":0},{"$f":"TypeListTemplate!P92","v":0},{"$f":"TypeListTemplate!Q92","v":0}]
[{"$f":"TypeListTemplate!A93","v":0},{"$f":"TypeListTemplate!B93","v":0},{"$f":"TypeListTemplate!C93","v":0},{"$f":"TypeListTemplate!D93","v":0},{"$f":"TypeListTemplate!E93","v":0},{"$f":"TypeListTemplate!F93","v":0},{"$f":"TypeListTemplate!G93","v":0},{"$f":"TypeListTemplate!H93","v":0},{"$f":"TypeListTemplate!I93","v":0},{"$f":"TypeListTemplate!J93","v":0},{"$f":"TypeListTemplate!K93","v":0},{"$f":"TypeListTemplate!L93","v":0},{"$f":"TypeListTemplate!M93","v":0},{"$f":"TypeListTemplate!N93","v":0},{"$f":"TypeListTemplate!O93","v":0},{"$f":"TypeListTemplate!P93","v":0},{"$f":"TypeListTemplate!Q93","v":0}]
[{"$f":"TypeListTemplate!A94","v":0},{"$f":"TypeListTemplate!B94","v":0},{"$f":"TypeListTemplate!C94","v":0},{"$f":"TypeListTemplate!D94","v":0},{"$f":"TypeListTemplate!E94","v":0},{"$f":"TypeListTemplate!F94","v":0},{"$f":"TypeListTemplate!G94","v":0},{"$f":"TypeListTemplate!H94","v":0},{"$f":"TypeListTemplate!I94","v":0},{"$f":"TypeListTemplate!J94","v":0},{"$f":"TypeListTemplate!K94","v":0},{"$f":"TypeListTemplate!L94","v":0},{"$f":"TypeListTemplate!M94","v":0},{"$f":"TypeListTemplate!N94","v":0},{"$f":"TypeListTemplate!O94","v":0},{"$f":"TypeListTemplate!P94","v":0},{"$f":"TypeListTemplate!Q94","v":0}]
[{"$f":"TypeListTemplate!A95","v":0},{"$f":"TypeListTemplate!B95","v":0},{"$f":"TypeListTemplate!C95","v":0},{"$f":"TypeListTemplate!D95","v":0},{"$f":"TypeListTemplate!E95","v":0},{"$f":"TypeListTemplate!F95","v":0},{"$f":"TypeListTemplate!G95","v":0},{"$f":"TypeListTemplate!H95","v":0},{"$f":"TypeListTemplate!I95","v":0},{"$f":"TypeListTemplate!J95","v":0},{"$f":"TypeListTemplate!K95","v":0},{"$f":"TypeListTemplate!L95","v":0},{"$f":"TypeListTemplate!M95","v":0},{"$f":"TypeListTemplate!N95","v":0},{"$f":"TypeListTemplate!O95","v":0},{"$f":"TypeListTemplate!P95","v":0},{"$f":"TypeListTemplate!Q95","v":0}]

{"sheet":"ACS310","index":7,"n_rows":94,"n_cols":17,"rows_kept":94,"cut":false,"hidden":true,"merged":[]}
["Typecode","Prod.class",null,"Voltage range 1",null,"Voltage range 2 (1-ph)",null,"Voltage range 2",null,"Voltage range 3",null,"Voltage range 4.6",null,"Voltage range 5",null,"Voltage range 7/6"]
[{"$f":"VLOOKUP(DriveSel!E20,C8:Y70,DriveSel!D18)","v":0},{"$f":"VLOOKUP(#REF!,C8:X69,7)","v":{"$error":"#REF!"}},"non-US (50Hz)"," 115 V (1-ph)",null," 230 V (1-ph)",null," 230 V (3-ph)",null," 400 V",null," 460 V",null," 500 V",null," 690 V"]
["Col.ordinal","Col.ordinal"]
[null,null,"Alternatives:","115 V 1-ph",null,"200/208/230/240 V 1-ph",null,"200/208/230/240 V 3-ph",null,"380/400/415 V",null,"440/460/480 V",null,"500 V",null,"525/550/575/600/660/690 V"]
[{"$f":"TypeListTemplate!A5","v":"Motor Power"},{"$f":"TypeListTemplate!B5","v":"Motor"},{"$f":"TypeListTemplate!C5","v":0},{"$f":"TypeListTemplate!D5","v":"Drive type"},{"$f":"TypeListTemplate!E5","v":0},{"$f":"TypeListTemplate!F5","v":"Drive type"},{"$f":"TypeListTemplate!G5","v":0},{"$f":"TypeListTemplate!H5","v":"Drive type"},{"$f":"TypeListTemplate!I5","v":0},{"$f":"TypeListTemplate!J5","v":"Drive type"},{"$f":"TypeListTemplate!K5","v":0},{"$f":"TypeListTemplate!L5","v":"Drive type"},{"$f":"TypeListTemplate!M5","v":0},{"$f":"TypeListTemplate!N5","v":"Drive type"},{"$f":"TypeListTemplate!O5","v":0},{"$f":"TypeListTemplate!P5","v":"Drive type"},{"$f":"TypeListTemplate!Q5","v":0}]
[{"$f":"TypeListTemplate!A6","v":"Hp"},{"$f":"TypeListTemplate!B6","v":"power kW"}]
[{"$f":"TypeListTemplate!A7","v":0},{"$f":"TypeListTemplate!B7","v":"Column Ordinal ->"},{"$f":"TypeListTemplate!C7","v":1},{"$f":"TypeListTemplate!D7","v":2},{"$f":"TypeListTemplate!E7","v":3},{"$f":"TypeListTemplate!F7","v":4},{"$f":"TypeListTemplate!G7","v":5},{"$f":"TypeListTemplate!H7","v":6},{"$f":"TypeListTemplate!I7","v":7},{"$f":"TypeListTemplate!J7","v":8},{"$f":"TypeListTemplate!K7","v":9},{"$f":"TypeListTemplate!L7","v":10},{"$f":"TypeListTemplate!M7","v":11},{"$f":"TypeListTemplate!N7","v":12},{"$f":"TypeListTemplate!O7","v":13},{"$f":"TypeListTemplate!P7","v":14},{"$f":"TypeListTemplate!Q7","v":15}]
[{"$f":"TypeListTemplate!A8","v":0},{"$f":"TypeListTemplate!B8","v":0},{"$f":"TypeListTemplate!C8","v":0}]
[{"$f":"TypeListTemplate!A9","v":7.3756202226096287E-2},{"$f":"TypeListTemplate!B9","v":5.5E-2},{"$f":"TypeListTemplate!C9","v":0.01}]
[{"$f":"TypeListTemplate!A10","v":0.12069196727906664},{"$f":"TypeListTemplate!B10","v":0.09},{"$f":"TypeListTemplate!C10","v":6.5000000000000002E-2},null,null,"ACS310-01E-02A4-2"]
[{"$f":"TypeListTemplate!A11","v":0.16092262303875551},{"$f":"TypeListTemplate!B11","v":0.12},{"$f":"TypeListTemplate!C11","v":9.9999999999999992E-2},null,null,"ACS310-01E-02A4-2"]
[{"$f":"TypeListTemplate!A12","v":0.24138393455813328},{"$f":"TypeListTemplate!B12","v":0.18},{"$f":"TypeListTemplate!C12","v":0.13},null,null,"ACS310-01E-02A4-2"]
[{"$f":"TypeListTemplate!A13","v":0.49617808770282951},{"$f":"TypeListTemplate!B13","v":0.37},{"$f":"TypeListTemplate!C13","v":0.19},null,null,"ACS310-01E-02A4-2",null,"ACS310-03E-02A6-2",null,"ACS310-03E-01A3-4",null,"ACS310-03E-01A3-4"]
[{"$f":"TypeListTemplate!A14","v":0.7375620222609629},{"$f":"TypeListTemplate!B14","v":0.55000000000000004},{"$f":"TypeListTemplate!C14","v":0.38},null,null,"ACS310-01E-04A7-2",null,"ACS310-03E-03A9-2",null,"ACS310-03E-02A1-4",null,"ACS310-03E-02A1-4"]
[{"$f":"TypeListTemplate!A15","v":1.0057663939922221},{"$f":"TypeListTemplate!B15","v":0.75},{"$f":"TypeListTemplate!C15","v":0.56000000000000005},null,null,"ACS310-01E-04A7-2",null,"ACS310-03E-05A2-2",null,"ACS310-03E-02A6-4",null,"ACS310-03E-02A6-4"]
[{"$f":"TypeListTemplate!A16","v":1.4751240445219258},{"$f":"TypeListTemplate!B16","v":1.1000000000000001},{"$f":"TypeListTemplate!C16","v":0.76},null,null,"ACS310-01E-06A7-2",null,"ACS310-03E-07A4-2",null,"ACS310-03E-03A6-4",null,"ACS310-03E-03A6-4"]
[{"$f":"TypeListTemplate!A17","v":2.0115327879844442},{"$f":"TypeListTemplate!B17","v":1.5},{"$f":"TypeListTemplate!C17","v":1.1100000000000001},null,null,"ACS310-01E-07A5-2",null,"ACS310-03E-08A3-2",null,"ACS310-03E-04A5-4",null,"ACS310-03E-04A5-4"]
[{"$f":"TypeListTemplate!A18","v":2.9502480890438516},{"$f":"TypeListTemplate!B18","v":2.2000000000000002},{"$f":"TypeListTemplate!C18","v":1.51},null,null,"ACS310-01E-09A8-2",null,"ACS310-03E-10A8-2",null,"ACS310-03E-06A2-4",null,"ACS310-03E-06A2-4"]
[{"$f":"TypeListTemplate!A19","v":4.0230655759688885},{"$f":"TypeListTemplate!B19","v":3},{"$f":"TypeListTemplate!C19","v":2.21},null,null,null,null,"ACS310-03E-14A6-2",null,"ACS310-03E-08A0-4",null,"ACS310-03E-08A0-4"]
[{"$f":"TypeListTemplate!A21","v":5.3640874346251843},{"$f":"TypeListTemplate!B21","v":4},{"$f":"TypeListTemplate!C21","v":3.7385000000000002},null,null,null,null,"ACS310-03E-19A4-2",null,"ACS310-03E-09A7-4",null,"ACS310-03E-09A7-4"]
[{"$f":"TypeListTemplate!A22","v":7.3756202226096281},{"$f":"TypeListTemplate!B22","v":5.5},{"$f":"TypeListTemplate!C22","v":4.01},null,null,null,null,"ACS310-03E-26A8-2",null,"ACS310-03E-13A8-4",null,"ACS310-03E-13A8-4"]
[{"$f":"TypeListTemplate!A23","v":10.05766393992222},{"$f":"TypeListTemplate!B23","v":7.5},{"$f":"TypeListTemplate!C23","v":5.51},null,null,null,null,"ACS310-03E-34A1-2",null,"ACS310-03E-17A2-4",null,"ACS310-03E-17A2-4"]
[{"$f":"TypeListTemplate!A24","v":14.751240445219256},{"$f":"TypeListTemplate!B24","v":11},{"$f":"TypeListTemplate!C24","v":7.51},null,null,null,null,"ACS310-03E-50A8-2",null,"ACS310-03E-25A4-4",null,"ACS310-03E-25A4-4"]
[{"$f":"TypeListTemplate!A25","v":20.11532787984444},{"$f":"TypeListTemplate!B25","v":15},{"$f":"TypeListTemplate!C25","v":11.01},null,null,null,null,null,null,"ACS310-03E-34A1-4",null,"ACS310-03E-34A1-4"]
[{"$f":"TypeListTemplate!A26","v":24.808904385141478},{"$f":"TypeListTemplate!B26","v":18.5},{"$f":"TypeListTemplate!C26","v":15.01},null,null,null,null,null,null,"ACS310-03E-41A8-4",null,"ACS310-03E-41A8-4"]
[{"$f":"TypeListTemplate!A27","v":29.502480890438513},{"$f":"TypeListTemplate!B27","v":22},{"$f":"TypeListTemplate!C27","v":18.510000000000002},null,null,null,null,null,null,"ACS310-03E-48A4-4",null,"ACS310-03E-48A4-4"]
[{"$f":"TypeListTemplate!A28","v":40.230655759688879},{"$f":"TypeListTemplate!B28","v":30},{"$f":"TypeListTemplate!C28","v":22.01}]
[{"$f":"TypeListTemplate!A29","v":49.617808770282956},{"$f":"TypeListTemplate!B29","v":37},{"$f":"TypeListTemplate!C29","v":30.01}]
[{"$f":"TypeListTemplate!A30","v":60.345983639533323},{"$f":"TypeListTemplate!B30","v":45},{"$f":"TypeListTemplate!C30","v":37.01}]
[{"$f":"TypeListTemplate!A31","v":73.756202226096278},{"$f":"TypeListTemplate!B31","v":55},{"$f":"TypeListTemplate!C31","v":45.01}]
[{"$f":"TypeListTemplate!A32","v":100.5766393992222},{"$f":"TypeListTemplate!B32","v":75},{"$f":"TypeListTemplate!C32","v":55.01}]
[{"$f":"TypeListTemplate!A33","v":120.69196727906665},{"$f":"TypeListTemplate!B33","v":90},{"$f":"TypeListTemplate!C33","v":75.010000000000005}]
[{"$f":"TypeListTemplate!A34","v":147.51240445219256},{"$f":"TypeListTemplate!B34","v":110},{"$f":"TypeListTemplate!C34","v":90.01}]
[{"$f":"TypeListTemplate!A35","v":177.01488534263109},{"$f":"TypeListTemplate!B35","v":132},{"$f":"TypeListTemplate!C35","v":110.01}]
[{"$f":"TypeListTemplate!A36","v":200},{"$f":"TypeListTemplate!B36","v":149.14000000000001},{"$f":"TypeListTemplate!C36","v":132.01}]
[{"$f":"TypeListTemplate!A37","v":214.56349738500737},{"$f":"TypeListTemplate!B37","v":160},{"$f":"TypeListTemplate!C37","v":149.15}]
[{"$f":"TypeListTemplate!A38","v":250},{"$f":"TypeListTemplate!B38","v":186.42500000000001},{"$f":"TypeListTemplate!C38","v":160.01}]
[{"$f":"TypeListTemplate!A39","v":268.20437173125919},{"$f":"TypeListTemplate!B39","v":200},{"$f":"TypeListTemplate!C39","v":186.435}]
[{"$f":"TypeListTemplate!A40","v":300},{"$f":"TypeListTemplate!B40","v":223.71},{"$f":"TypeListTemplate!C40","v":200.01}]
[{"$f":"TypeListTemplate!A41","v":335.255464664074},{"$f":"TypeListTemplate!B41","v":250},{"$f":"TypeListTemplate!C41","v":223.72}]
[{"$f":"TypeListTemplate!A42","v":400},{"$f":"TypeListTemplate!B42","v":298.28000000000003},{"$f":"TypeListTemplate!C42","v":250.01}]
[{"$f":"TypeListTemplate!A43","v":422.42188547673328},{"$f":"TypeListTemplate!B43","v":315},{"$f":"TypeListTemplate!C43","v":298.29000000000002}]
[{"$f":"TypeListTemplate!A44","v":476.06275982298507},{"$f":"TypeListTemplate!B44","v":355},{"$f":"TypeListTemplate!C44","v":315.01}]
[{"$f":"TypeListTemplate!A45","v":536.40874346251837},{"$f":"TypeListTemplate!B45","v":400},{"$f":"TypeListTemplate!C45","v":355.01}]
[{"$f":"TypeListTemplate!A46","v":603.45983639533324},{"$f":"TypeListTemplate!B46","v":450},{"$f":"TypeListTemplate!C46","v":400.01}]
[{"$f":"TypeListTemplate!A47","v":670.51092932814799},{"$f":"TypeListTemplate!B47","v":500},{"$f":"TypeListTemplate!C47","v":450.01}]
[{"$f":"TypeListTemplate!A48","v":750.97224084752577},{"$f":"TypeListTemplate!B48","v":560},{"$f":"TypeListTemplate!C48","v":500.01}]
[{"$f":"TypeListTemplate!A49","v":844.84377095346656},{"$f":"TypeListTemplate!B49","v":630},{"$f":"TypeListTemplate!C49","v":560.01}]
[{"$f":"TypeListTemplate!A50","v":952.12551964597014},{"$f":"TypeListTemplate!B50","v":710},{"$f":"TypeListTemplate!C50","v":630.01}]
[{"$f":"TypeListTemplate!A51","v":1072.8174869250367},{"$f":"TypeListTemplate!B51","v":800},{"$f":"TypeListTemplate!C51","v":710.01}]
[{"$f":"TypeListTemplate!A52","v":1206.9196727906665},{"$f":"TypeListTemplate!B52","v":900},{"$f":"TypeListTemplate!C52","v":800.01}]
[{"$f":"TypeListTemplate!A53","v":1341.021858656296},{"$f":"TypeListTemplate!B53","v":1000},{"$f":"TypeListTemplate!C53","v":900.01}]
[{"$f":"TypeListTemplate!A54","v":1501.9444816950515},{"$f":"TypeListTemplate!B54","v":1120},{"$f":"TypeListTemplate!C54","v":1000.01}]
[{"$f":"TypeListTemplate!A55","v":1676.27732332037},{"$f":"TypeListTemplate!B55","v":1250},{"$f":"TypeListTemplate!C55","v":1120.01}]
[{"$f":"TypeListTemplate!A56","v":1877.4306021188145},{"$f":"TypeListTemplate!B56","v":1400},{"$f":"TypeListTemplate!C56","v":1250.01}]
[{"$f":"TypeListTemplate!A57","v":2145.6349738500735},{"$f":"TypeListTemplate!B57","v":1600},{"$f":"TypeListTemplate!C57","v":1400.01}]
[{"$f":"TypeListTemplate!A58","v":2346.7882526485182},{"$f":"TypeListTemplate!B58","v":1750},{"$f":"TypeListTemplate!C58","v":1600.01}]
[{"$f":"TypeListTemplate!A59","v":2413.839345581333},{"$f":"TypeListTemplate!B59","v":1800},{"$f":"TypeListTemplate!C59","v":1750.01}]
[{"$f":"TypeListTemplate!A60","v":2682.043717312592},{"$f":"TypeListTemplate!B60","v":2000},{"$f":"TypeListTemplate!C60","v":1800.01}]
[{"$f":"TypeListTemplate!A61","v":2950.2480890438515},{"$f":"TypeListTemplate!B61","v":2200},{"$f":"TypeListTemplate!C61","v":2000.01}]
[{"$f":"TypeListTemplate!A62","v":3017.2991819766662},{"$f":"TypeListTemplate!B62","v":2250},{"$f":"TypeListTemplate!C62","v":2200.0100000000002}]
[{"$f":"TypeListTemplate!A63","v":3084.350274909481},{"$f":"TypeListTemplate!B63","v":2300},{"$f":"TypeListTemplate!C63","v":2250.0100000000002}]
[{"$f":"TypeListTemplate!A64","v":3352.55464664074},{"$f":"TypeListTemplate!B64","v":2500},{"$f":"TypeListTemplate!C64","v":2300.0100000000002}]
[{"$f":"TypeListTemplate!A65","v":3754.861204237629},{"$f":"TypeListTemplate!B65","v":2800},{"$f":"TypeListTemplate!C65","v":2500.0100000000002}]
[{"$f":"TypeListTemplate!A66","v":4224.2188547673322},{"$f":"TypeListTemplate!B66","v":3150},{"$f":"TypeListTemplate!C66","v":2800.01}]
[{"$f":"TypeListTemplate!A67","v":4760.6275982298512},{"$f":"TypeListTemplate!B67","v":3550},{"$f":"TypeListTemplate!C67","v":3150.01}]
[{"$f":"TypeListTemplate!A68","v":5364.087434625184},{"$f":"TypeListTemplate!B68","v":4000},{"$f":"TypeListTemplate!C68","v":3550.01}]
[{"$f":"TypeListTemplate!A69","v":6034.5983639533324},{"$f":"TypeListTemplate!B69","v":4500},{"$f":"TypeListTemplate!C69","v":4000.01}]
[{"$f":"TypeListTemplate!A70","v":6705.1092932814799},{"$f":"TypeListTemplate!B70","v":5000},{"$f":"TypeListTemplate!C70","v":4500.01}]
[{"$f":"TypeListTemplate!A71","v":0},{"$f":"TypeListTemplate!B71","v":999999999},{"$f":"TypeListTemplate!C71","v":5000.01}]
[{"$f":"TypeListTemplate!A72","v":0},{"$f":"TypeListTemplate!B72","v":0},{"$f":"TypeListTemplate!C72","v":0}]
[{"$f":"TypeListTemplate!A73","v":0},{"$f":"TypeListTemplate!B73","v":0},{"$f":"TypeListTemplate!C73","v":0},{"$f":"TypeListTemplate!D73","v":"Drive type"},{"$f":"TypeListTemplate!E73","v":0},{"$f":"TypeListTemplate!F73","v":"Drive type"},{"$f":"TypeListTemplate!G73","v":0},{"$f":"TypeListTemplate!H73","v":"Drive type"},{"$f":"TypeListTemplate!I73","v":0},{"$f":"TypeListTemplate!J73","v":"Drive type"},{"$f":"TypeListTemplate!K73","v":0},{"$f":"TypeListTemplate!L73","v":"Drive type"},{"$f":"TypeListTemplate!M73","v":0},{"$f":"TypeListTemplate!N73","v":"Drive type"},{"$f":"TypeListTemplate!O73","v":0},{"$f":"TypeListTemplate!P73","v":"Drive type"},{"$f":"TypeListTemplate!Q73","v":0}]
[{"$f":"TypeListTemplate!A74","v":0},{"$f":"TypeListTemplate!B74","v":0},{"$f":"TypeListTemplate!C74","v":0},{"$f":"TypeListTemplate!D74","v":" 115 V (1-ph)"},{"$f":"TypeListTemplate!E74","v":0},{"$f":"TypeListTemplate!F74","v":" 230 V (1-ph)"},{"$f":"TypeListTemplate!G74","v":0},{"$f":"TypeListTemplate!H74","v":" 230 V (3-ph)"},{"$f":"TypeListTemplate!I74","v":0},{"$f":"TypeListTemplate!J74","v":" 400 V"},{"$f":"TypeListTemplate!K74","v":0},{"$f":"TypeListTemplate!L74","v":" 460 V"},{"$f":"TypeListTemplate!M74","v":0},{"$f":"TypeListTemplate!N74","v":" 500 V"},{"$f":"TypeListTemplate!O74","v":0},{"$f":"TypeListTemplate!P74","v":" 690 V"},{"$f":"TypeListTemplate!Q74","v":0}]
[{"$f":"TypeListTemplate!A75","v":0},{"$f":"TypeListTemplate!B75","v":0},{"$f":"TypeListTemplate!C75","v":0},{"$f":"TypeListTemplate!D75","v":0},{"$f":"TypeListTemplate!E75","v":0},{"$f":"TypeListTemplate!F75","v":0},{"$f":"TypeListTemplate!G75","v":0},{"$f":"TypeListTemplate!H75","v":0},{"$f":"TypeListTemplate!I75","v":0},{"$f":"TypeListTemplate!J75","v":0},{"$f":"TypeListTemplate!K75","v":0},{"$f":"TypeListTemplate!L75","v":0},{"$f":"TypeListTemplate!M75","v":0},{"$f":"TypeListTemplate!N75","v":0},{"$f":"TypeListTemplate!O75","v":0},{"$f":"TypeListTemplate!P75","v":0},{"$f":"TypeListTemplate!Q75","v":0}]
[{"$f":"TypeListTemplate!A76","v":0},{"$f":"TypeListTemplate!B76","v":0},{"$f":"TypeListTemplate!C76","v":0},{"$f":"TypeListTemplate!D76","v":0},{"$f":"TypeListTemplate!E76","v":0},{"$f":"TypeListTemplate!F76","v":0},{"$f":"TypeListTemplate!G76","v":0},{"$f":"TypeListTemplate!H76","v":0},{"$f":"TypeListTemplate!I76","v":0},{"$f":"TypeListTemplate!J76","v":0},{"$f":"TypeListTemplate!K76","v":0},{"$f":"TypeListTemplate!L76","v":0},{"$f":"TypeListTemplate!M76","v":0},{"$f":"TypeListTemplate!N76","v":0},{"$f":"TypeListTemplate!O76","v":0},{"$f":"TypeListTemplate!P76","v":0},{"$f":"TypeListTemplate!Q76","v":0}]
[{"$f":"TypeListTemplate!A77","v":0},{"$f":"TypeListTemplate!B77","v":0},{"$f":"TypeListTemplate!C77","v":0},{"$f":"TypeListTemplate!D77","v":0},{"$f":"TypeListTemplate!E77","v":0},{"$f":"TypeListTemplate!F77","v":0},{"$f":"TypeListTemplate!G77","v":0},{"$f":"TypeListTemplate!H77","v":0},{"$f":"TypeListTemplate!I77","v":0},{"$f":"TypeListTemplate!J77","v":0},{"$f":"TypeListTemplate!K77","v":0},{"$f":"TypeListTemplate!L77","v":0},{"$f":"TypeListTemplate!M77","v":0},{"$f":"TypeListTemplate!N77","v":0},{"$f":"TypeListTemplate!O77","v":0},{"$f":"TypeListTemplate!P77","v":0},{"$f":"TypeListTemplate!Q77","v":0}]
[{"$f":"TypeListTemplate!A78","v":0},{"$f":"TypeListTemplate!B78","v":0},{"$f":"TypeListTemplate!C78","v":0},{"$f":"TypeListTemplate!D78","v":0},{"$f":"TypeListTemplate!E78","v":0},{"$f":"TypeListTemplate!F78","v":0},{"$f":"TypeListTemplate!G78","v":0},{"$f":"TypeListTemplate!H78","v":0},{"$f":"TypeListTemplate!I78","v":0},{"$f":"TypeListTemplate!J78","v":0},{"$f":"TypeListTemplate!K78","v":0},{"$f":"TypeListTemplate!L78","v":0},{"$f":"TypeListTemplate!M78","v":0},{"$f":"TypeListTemplate!N78","v":0},{"$f":"TypeListTemplate!O78","v":0},{"$f":"TypeListTemplate!P78","v":0},{"$f":"TypeListTemplate!Q78","v":0}]
[{"$f":"TypeListTemplate!A79","v":0},{"$f":"TypeListTemplate!B79","v":0},{"$f":"TypeListTemplate!C79","v":0},{"$f":"TypeListTemplate!D79","v":0},{"$f":"TypeListTemplate!E79","v":0},{"$f":"TypeListTemplate!F79","v":0},{"$f":"TypeListTemplate!G79","v":0},{"$f":"TypeListTemplate!H79","v":0},{"$f":"TypeListTemplate!I79","v":0},{"$f":"TypeListTemplate!J79","v":0},{"$f":"TypeListTemplate!K79","v":0},{"$f":"TypeListTemplate!L79","v":0},{"$f":"TypeListTemplate!M79","v":0},{"$f":"TypeListTemplate!N79","v":0},{"$f":"TypeListTemplate!O79","v":0},{"$f":"TypeListTemplate!P79","v":0},{"$f":"TypeListTemplate!Q79","v":0}]
[{"$f":"TypeListTemplate!A80","v":0},{"$f":"TypeListTemplate!B80","v":0},{"$f":"TypeListTemplate!C80","v":0},{"$f":"TypeListTemplate!D80","v":0},{"$f":"TypeListTemplate!E80","v":0},{"$f":"TypeListTemplate!F80","v":0},{"$f":"TypeListTemplate!G80","v":0},{"$f":"TypeListTemplate!H80","v":0},{"$f":"TypeListTemplate!I80","v":0},{"$f":"TypeListTemplate!J80","v":0},{"$f":"TypeListTemplate!K80","v":0},{"$f":"TypeListTemplate!L80","v":0},{"$f":"TypeListTemplate!M80","v":0},{"$f":"TypeListTemplate!N80","v":0},{"$f":"TypeListTemplate!O80","v":0},{"$f":"TypeListTemplate!P80","v":0},{"$f":"TypeListTemplate!Q80","v":0}]
[{"$f":"TypeListTemplate!A81","v":0},{"$f":"TypeListTemplate!B81","v":0},{"$f":"TypeListTemplate!C81","v":0},{"$f":"TypeListTemplate!D81","v":0},{"$f":"TypeListTemplate!E81","v":0},{"$f":"TypeListTemplate!F81","v":0},{"$f":"TypeListTemplate!G81","v":0},{"$f":"TypeListTemplate!H81","v":0},{"$f":"TypeListTemplate!I81","v":0},{"$f":"TypeListTemplate!J81","v":0},{"$f":"TypeListTemplate!K81","v":0},{"$f":"TypeListTemplate!L81","v":0},{"$f":"TypeListTemplate!M81","v":0},{"$f":"TypeListTemplate!N81","v":0},{"$f":"TypeListTemplate!O81","v":0},{"$f":"TypeListTemplate!P81","v":0},{"$f":"TypeListTemplate!Q81","v":0}]
[{"$f":"TypeListTemplate!A82","v":0},{"$f":"TypeListTemplate!B82","v":0},{"$f":"TypeListTemplate!C82","v":0},{"$f":"TypeListTemplate!D82","v":0},{"$f":"TypeListTemplate!E82","v":0},{"$f":"TypeListTemplate!F82","v":0},{"$f":"TypeListTemplate!G82","v":0},{"$f":"TypeListTemplate!H82","v":0},{"$f":"TypeListTemplate!I82","v":0},{"$f":"TypeListTemplate!J82","v":0},{"$f":"TypeListTemplate!K82","v":0},{"$f":"TypeListTemplate!L82","v":0},{"$f":"TypeListTemplate!M82","v":0},{"$f":"TypeListTemplate!N82","v":0},{"$f":"TypeListTemplate!O82","v":0},{"$f":"TypeListTemplate!P82","v":0},{"$f":"TypeListTemplate!Q82","v":0}]
[{"$f":"TypeListTemplate!A83","v":0},{"$f":"TypeListTemplate!B83","v":0},{"$f":"TypeListTemplate!C83","v":0},{"$f":"TypeListTemplate!D83","v":0},{"$f":"TypeListTemplate!E83","v":0},{"$f":"TypeListTemplate!F83","v":0},{"$f":"TypeListTemplate!G83","v":0},{"$f":"TypeListTemplate!H83","v":0},{"$f":"TypeListTemplate!I83","v":0},{"$f":"TypeListTemplate!J83","v":0},{"$f":"TypeListTemplate!K83","v":0},{"$f":"TypeListTemplate!L83","v":0},{"$f":"TypeListTemplate!M83","v":0},{"$f":"TypeListTemplate!N83","v":0},{"$f":"TypeListTemplate!O83","v":0},{"$f":"TypeListTemplate!P83","v":0},{"$f":"TypeListTemplate!Q83","v":0}]
[{"$f":"TypeListTemplate!A84","v":0},{"$f":"TypeListTemplate!B84","v":0},{"$f":"TypeListTemplate!C84","v":0},{"$f":"TypeListTemplate!D84","v":0},{"$f":"TypeListTemplate!E84","v":0},{"$f":"TypeListTemplate!F84","v":0},{"$f":"TypeListTemplate!G84","v":0},{"$f":"TypeListTemplate!H84","v":0},{"$f":"TypeListTemplate!I84","v":0},{"$f":"TypeListTemplate!J84","v":0},{"$f":"TypeListTemplate!K84","v":0},{"$f":"TypeListTemplate!L84","v":0},{"$f":"TypeListTemplate!M84","v":0},{"$f":"TypeListTemplate!N84","v":0},{"$f":"TypeListTemplate!O84","v":0},{"$f":"TypeListTemplate!P84","v":0},{"$f":"TypeListTemplate!Q84","v":0}]
[{"$f":"TypeListTemplate!A85","v":0},{"$f":"TypeListTemplate!B85","v":0},{"$f":"TypeListTemplate!C85","v":0},{"$f":"TypeListTemplate!D85","v":0},{"$f":"TypeListTemplate!E85","v":0},{"$f":"TypeListTemplate!F85","v":0},{"$f":"TypeListTemplate!G85","v":0},{"$f":"TypeListTemplate!H85","v":0},{"$f":"TypeListTemplate!I85","v":0},{"$f":"TypeListTemplate!J85","v":0},{"$f":"TypeListTemplate!K85","v":0},{"$f":"TypeListTemplate!L85","v":0},{"$f":"TypeListTemplate!M85","v":0},{"$f":"TypeListTemplate!N85","v":0},{"$f":"TypeListTemplate!O85","v":0},{"$f":"TypeListTemplate!P85","v":0},{"$f":"TypeListTemplate!Q85","v":0}]
[{"$f":"TypeListTemplate!A86","v":0},{"$f":"TypeListTemplate!B86","v":0},{"$f":"TypeListTemplate!C86","v":0},{"$f":"TypeListTemplate!D86","v":0},{"$f":"TypeListTemplate!E86","v":0},{"$f":"TypeListTemplate!F86","v":0},{"$f":"TypeListTemplate!G86","v":0},{"$f":"TypeListTemplate!H86","v":0},{"$f":"TypeListTemplate!I86","v":0},{"$f":"TypeListTemplate!J86","v":0},{"$f":"TypeListTemplate!K86","v":0},{"$f":"TypeListTemplate!L86","v":0},{"$f":"TypeListTemplate!M86","v":0},{"$f":"TypeListTemplate!N86","v":0},{"$f":"TypeListTemplate!O86","v":0},{"$f":"TypeListTemplate!P86","v":0},{"$f":"TypeListTemplate!Q86","v":0}]
[{"$f":"TypeListTemplate!A87","v":0},{"$f":"TypeListTemplate!B87","v":0},{"$f":"TypeListTemplate!C87","v":0},{"$f":"TypeListTemplate!D87","v":0},{"$f":"TypeListTemplate!E87","v":0},{"$f":"TypeListTemplate!F87","v":0},{"$f":"TypeListTemplate!G87","v":0},{"$f":"TypeListTemplate!H87","v":0},{"$f":"TypeListTemplate!I87","v":0},{"$f":"TypeListTemplate!J87","v":0},{"$f":"TypeListTemplate!K87","v":0},{"$f":"TypeListTemplate!L87","v":0},{"$f":"TypeListTemplate!M87","v":0},{"$f":"TypeListTemplate!N87","v":0},{"$f":"TypeListTemplate!O87","v":0},{"$f":"TypeListTemplate!P87","v":0},{"$f":"TypeListTemplate!Q87","v":0}]
[{"$f":"TypeListTemplate!A88","v":0},{"$f":"TypeListTemplate!B88","v":0},{"$f":"TypeListTemplate!C88","v":0},{"$f":"TypeListTemplate!D88","v":0},{"$f":"TypeListTemplate!E88","v":0},{"$f":"TypeListTemplate!F88","v":0},{"$f":"TypeListTemplate!G88","v":0},{"$f":"TypeListTemplate!H88","v":0},{"$f":"TypeListTemplate!I88","v":0},{"$f":"TypeListTemplate!J88","v":0},{"$f":"TypeListTemplate!K88","v":0},{"$f":"TypeListTemplate!L88","v":0},{"$f":"TypeListTemplate!M88","v":0},{"$f":"TypeListTemplate!N88","v":0},{"$f":"TypeListTemplate!O88","v":0},{"$f":"TypeListTemplate!P88","v":0},{"$f":"TypeListTemplate!Q88","v":0}]
[{"$f":"TypeListTemplate!A89","v":0},{"$f":"TypeListTemplate!B89","v":0},{"$f":"TypeListTemplate!C89","v":0},{"$f":"TypeListTemplate!D89","v":0},{"$f":"TypeListTemplate!E89","v":0},{"$f":"TypeListTemplate!F89","v":0},{"$f":"TypeListTemplate!G89","v":0},{"$f":"TypeListTemplate!H89","v":0},{"$f":"TypeListTemplate!I89","v":0},{"$f":"TypeListTemplate!J89","v":0},{"$f":"TypeListTemplate!K89","v":0},{"$f":"TypeListTemplate!L89","v":0},{"$f":"TypeListTemplate!M89","v":0},{"$f":"TypeListTemplate!N89","v":0},{"$f":"TypeListTemplate!O89","v":0},{"$f":"TypeListTemplate!P89","v":0},{"$f":"TypeListTemplate!Q89","v":0}]
[{"$f":"TypeListTemplate!A90","v":0},{"$f":"TypeListTemplate!B90","v":0},{"$f":"TypeListTemplate!C90","v":0},{"$f":"TypeListTemplate!D90","v":0},{"$f":"TypeListTemplate!E90","v":0},{"$f":"TypeListTemplate!F90","v":0},{"$f":"TypeListTemplate!G90","v":0},{"$f":"TypeListTemplate!H90","v":0},{"$f":"TypeListTemplate!I90","v":0},{"$f":"TypeListTemplate!J90","v":0},{"$f":"TypeListTemplate!K90","v":0},{"$f":"TypeListTemplate!L90","v":0},{"$f":"TypeListTemplate!M90","v":0},{"$f":"TypeListTemplate!N90","v":0},{"$f":"TypeListTemplate!O90","v":0},{"$f":"TypeListTemplate!P90","v":0},{"$f":"TypeListTemplate!Q90","v":0}]
[{"$f":"TypeListTemplate!A91","v":0},{"$f":"TypeListTemplate!B91","v":0},{"$f":"TypeListTemplate!C91","v":0},{"$f":"TypeListTemplate!D91","v":0},{"$f":"TypeListTemplate!E91","v":0},{"$f":"TypeListTemplate!F91","v":0},{"$f":"TypeListTemplate!G91","v":0},{"$f":"TypeListTemplate!H91","v":0},{"$f":"TypeListTemplate!I91","v":0},{"$f":"TypeListTemplate!J91","v":0},{"$f":"TypeListTemplate!K91","v":0},{"$f":"TypeListTemplate!L91","v":0},{"$f":"TypeListTemplate!M91","v":0},{"$f":"TypeListTemplate!N91","v":0},{"$f":"TypeListTemplate!O91","v":0},{"$f":"TypeListTemplate!P91","v":0},{"$f":"TypeListTemplate!Q91","v":0}]
[{"$f":"TypeListTemplate!A92","v":0},{"$f":"TypeListTemplate!B92","v":0},{"$f":"TypeListTemplate!C92","v":0},{"$f":"TypeListTemplate!D92","v":0},{"$f":"TypeListTemplate!E92","v":0},{"$f":"TypeListTemplate!F92","v":0},{"$f":"TypeListTemplate!G92","v":0},{"$f":"TypeListTemplate!H92","v":0},{"$f":"TypeListTemplate!I92","v":0},{"$f":"TypeListTemplate!J92","v":0},{"$f":"TypeListTemplate!K92","v":0},{"$f":"TypeListTemplate!L92","v":0},{"$f":"TypeListTemplate!M92","v":0},{"$f":"TypeListTemplate!N92","v":0},{"$f":"TypeListTemplate!O92","v":0},{"$f":"TypeListTemplate!P92","v":0},{"$f":"TypeListTemplate!Q92","v":0}]
[{"$f":"TypeListTemplate!A93","v":0},{"$f":"TypeListTemplate!B93","v":0},{"$f":"TypeListTemplate!C93","v":0},{"$f":"TypeListTemplate!D93","v":0},{"$f":"TypeListTemplate!E93","v":0},{"$f":"TypeListTemplate!F93","v":0},{"$f":"TypeListTemplate!G93","v":0},{"$f":"TypeListTemplate!H93","v":0},{"$f":"TypeListTemplate!I93","v":0},{"$f":"TypeListTemplate!J93","v":0},{"$f":"TypeListTemplate!K93","v":0},{"$f":"TypeListTemplate!L93","v":0},{"$f":"TypeListTemplate!M93","v":0},{"$f":"TypeListTemplate!N93","v":0},{"$f":"TypeListTemplate!O93","v":0},{"$f":"TypeListTemplate!P93","v":0},{"$f":"TypeListTemplate!Q93","v":0}]
[{"$f":"TypeListTemplate!A94","v":0},{"$f":"TypeListTemplate!B94","v":0},{"$f":"TypeListTemplate!C94","v":0},{"$f":"TypeListTemplate!D94","v":0},{"$f":"TypeListTemplate!E94","v":0},{"$f":"TypeListTemplate!F94","v":0},{"$f":"TypeListTemplate!G94","v":0},{"$f":"TypeListTemplate!H94","v":0},{"$f":"TypeListTemplate!I94","v":0},{"$f":"TypeListTemplate!J94","v":0},{"$f":"TypeListTemplate!K94","v":0},{"$f":"TypeListTemplate!L94","v":0},{"$f":"TypeListTemplate!M94","v":0},{"$f":"TypeListTemplate!N94","v":0},{"$f":"TypeListTemplate!O94","v":0},{"$f":"TypeListTemplate!P94","v":0},{"$f":"TypeListTemplate!Q94","v":0}]
[{"$f":"TypeListTemplate!A95","v":0},{"$f":"TypeListTemplate!B95","v":0},{"$f":"TypeListTemplate!C95","v":0},{"$f":"TypeListTemplate!D95","v":0},{"$f":"TypeListTemplate!E95","v":0},{"$f":"TypeListTemplate!F95","v":0},0,{"$f":"TypeListTemplate!H95","v":0},{"$f":"TypeListTemplate!I95","v":0},{"$f":"TypeListTemplate!J95","v":0},{"$f":"TypeListTemplate!K95","v":0},{"$f":"TypeListTemplate!L95","v":0},{"$f":"TypeListTemplate!M95","v":0},{"$f":"TypeListTemplate!N95","v":0},{"$f":"TypeListTemplate!O95","v":0},{"$f":"TypeListTemplate!P95","v":0},{"$f":"TypeListTemplate!Q95","v":0}]

{"sheet":"ACS355","index":8,"n_rows":95,"n_cols":17,"rows_kept":95,"cut":false,"hidden":true,"merged":[]}
["Typecode","Prod.class",null,"Voltage range 1",null,"Voltage range 2 (1-ph)",null,"Voltage range 2",null,"Voltage range 3",null,"Voltage range 4.6",null,"Voltage range 5",null,"Voltage range 7/6"]
[{"$f":"VLOOKUP(DriveSel!E20,C8:Y71,DriveSel!D18)","v":0},{"$f":"VLOOKUP(#REF!,C8:X70,7)","v":{"$error":"#REF!"}},"non-US (50Hz)"," 115 V (1-ph)",null," 230 V (1-ph)",null," 230 V (3-ph)",null," 400 V",null," 460 V",null," 500 V",null," 690 V"]
["Col.ordinal","Col.ordinal"]
[null,null,"Alternatives:","115 V 1-ph",null,"200/208/230/240 V 1-ph",null,"200/208/230/240 V 3-ph",null,"380/400/415 V",null,"440/460/480 V",null,"500 V",null,"525/550/575/600/660/690 V"]
[{"$f":"TypeListTemplate!A5","v":"Motor Power"},{"$f":"TypeListTemplate!B5","v":"Motor"},{"$f":"TypeListTemplate!C5","v":0},{"$f":"TypeListTemplate!D5","v":"Drive type"},{"$f":"TypeListTemplate!E5","v":0},{"$f":"TypeListTemplate!F5","v":"Drive type"},{"$f":"TypeListTemplate!G5","v":0},{"$f":"TypeListTemplate!H5","v":"Drive type"},{"$f":"TypeListTemplate!I5","v":0},{"$f":"TypeListTemplate!J5","v":"Drive type"},{"$f":"TypeListTemplate!K5","v":0},{"$f":"TypeListTemplate!L5","v":"Drive type"},{"$f":"TypeListTemplate!M5","v":0},{"$f":"TypeListTemplate!N5","v":"Drive type"},{"$f":"TypeListTemplate!O5","v":0},{"$f":"TypeListTemplate!P5","v":"Drive type"},{"$f":"TypeListTemplate!Q5","v":0}]
[{"$f":"TypeListTemplate!A6","v":"Hp"},{"$f":"TypeListTemplate!B6","v":"power kW"}]
[{"$f":"TypeListTemplate!A7","v":0},{"$f":"TypeListTemplate!B7","v":"Column Ordinal ->"},{"$f":"TypeListTemplate!C7","v":1},{"$f":"TypeListTemplate!D7","v":2},{"$f":"TypeListTemplate!E7","v":3},{"$f":"TypeListTemplate!F7","v":4},{"$f":"TypeListTemplate!G7","v":5},{"$f":"TypeListTemplate!H7","v":6},{"$f":"TypeListTemplate!I7","v":7},{"$f":"TypeListTemplate!J7","v":8},{"$f":"TypeListTemplate!K7","v":9},{"$f":"TypeListTemplate!L7","v":10},{"$f":"TypeListTemplate!M7","v":11},{"$f":"TypeListTemplate!N7","v":12},{"$f":"TypeListTemplate!O7","v":13},{"$f":"TypeListTemplate!P7","v":14},{"$f":"TypeListTemplate!Q7","v":15}]
[{"$f":"TypeListTemplate!A8","v":0},{"$f":"TypeListTemplate!B8","v":0},{"$f":"TypeListTemplate!C8","v":0}]
[{"$f":"TypeListTemplate!A9","v":7.3756202226096287E-2},{"$f":"TypeListTemplate!B9","v":5.5E-2},{"$f":"TypeListTemplate!C9","v":0.01}]
[{"$f":"TypeListTemplate!A10","v":0.12069196727906664},{"$f":"TypeListTemplate!B10","v":0.09},{"$f":"TypeListTemplate!C10","v":6.5000000000000002E-2},null,null,"ACS355-01E-02A4-2"]
[{"$f":"TypeListTemplate!A11","v":0.16092262303875551},{"$f":"TypeListTemplate!B11","v":0.12},{"$f":"TypeListTemplate!C11","v":9.9999999999999992E-2},null,null,"ACS355-01E-02A4-2",null,"ACS355-03E-02A4-2",null,"ACS355-03E-01A2-4",null,"ACS355-03E-01A2-4"]
[{"$f":"TypeListTemplate!A12","v":0.24138393455813328},{"$f":"TypeListTemplate!B12","v":0.18},{"$f":"TypeListTemplate!C12","v":0.13},null,null,"ACS355-01E-02A4-2",null,"ACS355-03E-02A4-2",null,"ACS355-03E-01A2-4",null,"ACS355-03E-01A2-4"]
[{"$f":"TypeListTemplate!A13","v":0.49617808770282951},{"$f":"TypeListTemplate!B13","v":0.37},{"$f":"TypeListTemplate!C13","v":0.19},null,null,"ACS355-01E-02A4-2",null,"ACS355-03E-02A4-2",null,"ACS355-03E-01A2-4",null,"ACS355-03E-01A2-4"]
[{"$f":"TypeListTemplate!A14","v":0.7375620222609629},{"$f":"TypeListTemplate!B14","v":0.55000000000000004},{"$f":"TypeListTemplate!C14","v":0.38},null,null,"ACS355-01E-04A7-2",null,"ACS355-03E-03A5-2",null,"ACS355-03E-01A9-4",null,"ACS355-03E-01A9-4"]
[{"$f":"TypeListTemplate!A15","v":1.0057663939922221},{"$f":"TypeListTemplate!B15","v":0.75},{"$f":"TypeListTemplate!C15","v":0.56000000000000005},null,null,"ACS355-01E-04A7-2",null,"ACS355-03E-04A7-2",null,"ACS355-03E-02A4-4",null,"ACS355-03E-02A4-4"]
[{"$f":"TypeListTemplate!A16","v":1.4751240445219258},{"$f":"TypeListTemplate!B16","v":1.1000000000000001},{"$f":"TypeListTemplate!C16","v":0.76},null,null,"ACS355-01E-06A7-2",null,"ACS355-03E-06A7-2",null,"ACS355-03E-03A3-4",null,"ACS355-03E-03A3-4"]
[{"$f":"TypeListTemplate!A17","v":2.0115327879844442},{"$f":"TypeListTemplate!B17","v":1.5},{"$f":"TypeListTemplate!C17","v":1.1100000000000001},null,null,"ACS355-01E-07A5-2",null,"ACS355-03E-07A5-2",null,"ACS355-03E-04A1-4",null,"ACS355-03E-04A1-4"]
[{"$f":"TypeListTemplate!A18","v":2.9502480890438516},{"$f":"TypeListTemplate!B18","v":2.2000000000000002},{"$f":"TypeListTemplate!C18","v":1.51},null,null,"ACS355-01E-09A8-2",null,"ACS355-03E-09A8-2",null,"ACS355-03E-05A6-4",null,"ACS355-03E-05A6-4"]
[{"$f":"TypeListTemplate!A19","v":4.0230655759688885},{"$f":"TypeListTemplate!B19","v":3},{"$f":"TypeListTemplate!C19","v":2.21},null,null,null,null,"ACS355-03E-13A3-2",null,"ACS355-03E-07A3-4",null,"ACS355-03E-07A3-4"]
[{"$f":"TypeListTemplate!A20","v":5},{"$f":"TypeListTemplate!B20","v":3.7285000000000004},{"$f":"TypeListTemplate!C20","v":3.01},null,null,null,null,"ACS355-03E-17A6-2",null,"ACS355-03E-08A8-4",null,"ACS355-03E-07A3-4"]
[{"$f":"TypeListTemplate!A21","v":5.3640874346251843},{"$f":"TypeListTemplate!B21","v":4},{"$f":"TypeListTemplate!C21","v":3.7385000000000002},null,null,null,null,"ACS355-03E-17A6-2",null,"ACS355-03E-08A8-4",null,"ACS355-03E-08A8-4"]
[{"$f":"TypeListTemplate!A22","v":7.3756202226096281},{"$f":"TypeListTemplate!B22","v":5.5},{"$f":"TypeListTemplate!C22","v":4.01},null,null,null,null,"ACS355-03E-24A4-2",null,"ACS355-03E-12A5-4",null,"ACS355-03E-12A5-4"]
[{"$f":"TypeListTemplate!A23","v":10.05766393992222},{"$f":"TypeListTemplate!B23","v":7.5},{"$f":"TypeListTemplate!C23","v":5.51},null,null,null,null,"ACS355-03E-31A0-2",null,"ACS355-03E-15A6-4",null,"ACS355-03E-15A6-4"]
[{"$f":"TypeListTemplate!A24","v":14.751240445219256},{"$f":"TypeListTemplate!B24","v":11},{"$f":"TypeListTemplate!C24","v":7.51},null,null,null,null,"ACS355-03E-46A2-2",null,"ACS355-03E-23A1-4",null,"ACS355-03E-23A1-4"]
[{"$f":"TypeListTemplate!A25","v":20.11532787984444},{"$f":"TypeListTemplate!B25","v":15},{"$f":"TypeListTemplate!C25","v":11.01},null,null,null,null,null,null,"ACS355-03E-31A0-4",null,"ACS355-03E-31A0-4"]
[{"$f":"TypeListTemplate!A26","v":24.808904385141478},{"$f":"TypeListTemplate!B26","v":18.5},{"$f":"TypeListTemplate!C26","v":15.01},null,null,null,null,null,null,"ACS355-03E-38A0-4",null,"ACS355-03E-38A0-4"]
[{"$f":"TypeListTemplate!A27","v":29.502480890438513},{"$f":"TypeListTemplate!B27","v":22},{"$f":"TypeListTemplate!C27","v":18.510000000000002},null,null,null,null,null,null,"ACS355-03E-44A0-4",null,"ACS355-03E-44A0-4"]
[{"$f":"TypeListTemplate!A28","v":40.230655759688879},{"$f":"TypeListTemplate!B28","v":30},{"$f":"TypeListTemplate!C28","v":22.01}]
[{"$f":"TypeListTemplate!A29","v":49.617808770282956},{"$f":"TypeListTemplate!B29","v":37},{"$f":"TypeListTemplate!C29","v":30.01}]
[{"$f":"TypeListTemplate!A30","v":60.345983639533323},{"$f":"TypeListTemplate!B30","v":45},{"$f":"TypeListTemplate!C30","v":37.01}]
[{"$f":"TypeListTemplate!A31","v":73.756202226096278},{"$f":"TypeListTemplate!B31","v":55},{"$f":"TypeListTemplate!C31","v":45.01}]
[{"$f":"TypeListTemplate!A32","v":100.5766393992222},{"$f":"TypeListTemplate!B32","v":75},{"$f":"TypeListTemplate!C32","v":55.01}]
[{"$f":"TypeListTemplate!A33","v":120.69196727906665},{"$f":"TypeListTemplate!B33","v":90},{"$f":"TypeListTemplate!C33","v":75.010000000000005}]
[{"$f":"TypeListTemplate!A34","v":147.51240445219256},{"$f":"TypeListTemplate!B34","v":110},{"$f":"TypeListTemplate!C34","v":90.01}]
[{"$f":"TypeListTemplate!A35","v":177.01488534263109},{"$f":"TypeListTemplate!B35","v":132},{"$f":"TypeListTemplate!C35","v":110.01}]
[{"$f":"TypeListTemplate!A36","v":200},{"$f":"TypeListTemplate!B36","v":149.14000000000001},{"$f":"TypeListTemplate!C36","v":132.01}]
[{"$f":"TypeListTemplate!A37","v":214.56349738500737},{"$f":"TypeListTemplate!B37","v":160},{"$f":"TypeListTemplate!C37","v":149.15}]
[{"$f":"TypeListTemplate!A38","v":250},{"$f":"TypeListTemplate!B38","v":186.42500000000001},{"$f":"TypeListTemplate!C38","v":160.01}]
[{"$f":"TypeListTemplate!A39","v":268.20437173125919},{"$f":"TypeListTemplate!B39","v":200},{"$f":"TypeListTemplate!C39","v":186.435}]
[{"$f":"TypeListTemplate!A40","v":300},{"$f":"TypeListTemplate!B40","v":223.71},{"$f":"TypeListTemplate!C40","v":200.01}]
[{"$f":"TypeListTemplate!A41","v":335.255464664074},{"$f":"TypeListTemplate!B41","v":250},{"$f":"TypeListTemplate!C41","v":223.72}]
[{"$f":"TypeListTemplate!A42","v":400},{"$f":"TypeListTemplate!B42","v":298.28000000000003},{"$f":"TypeListTemplate!C42","v":250.01}]
[{"$f":"TypeListTemplate!A43","v":422.42188547673328},{"$f":"TypeListTemplate!B43","v":315},{"$f":"TypeListTemplate!C43","v":298.29000000000002}]
[{"$f":"TypeListTemplate!A44","v":476.06275982298507},{"$f":"TypeListTemplate!B44","v":355},{"$f":"TypeListTemplate!C44","v":315.01}]
[{"$f":"TypeListTemplate!A45","v":536.40874346251837},{"$f":"TypeListTemplate!B45","v":400},{"$f":"TypeListTemplate!C45","v":355.01}]
[{"$f":"TypeListTemplate!A46","v":603.45983639533324},{"$f":"TypeListTemplate!B46","v":450},{"$f":"TypeListTemplate!C46","v":400.01}]
[{"$f":"TypeListTemplate!A47","v":670.51092932814799},{"$f":"TypeListTemplate!B47","v":500},{"$f":"TypeListTemplate!C47","v":450.01}]
[{"$f":"TypeListTemplate!A48","v":750.97224084752577},{"$f":"TypeListTemplate!B48","v":560},{"$f":"TypeListTemplate!C48","v":500.01}]
[{"$f":"TypeListTemplate!A49","v":844.84377095346656},{"$f":"TypeListTemplate!B49","v":630},{"$f":"TypeListTemplate!C49","v":560.01}]
[{"$f":"TypeListTemplate!A50","v":952.12551964597014},{"$f":"TypeListTemplate!B50","v":710},{"$f":"TypeListTemplate!C50","v":630.01}]
[{"$f":"TypeListTemplate!A51","v":1072.8174869250367},{"$f":"TypeListTemplate!B51","v":800},{"$f":"TypeListTemplate!C51","v":710.01}]
[{"$f":"TypeListTemplate!A52","v":1206.9196727906665},{"$f":"TypeListTemplate!B52","v":900},{"$f":"TypeListTemplate!C52","v":800.01}]
[{"$f":"TypeListTemplate!A53","v":1341.021858656296},{"$f":"TypeListTemplate!B53","v":1000},{"$f":"TypeListTemplate!C53","v":900.01}]
[{"$f":"TypeListTemplate!A54","v":1501.9444816950515},{"$f":"TypeListTemplate!B54","v":1120},{"$f":"TypeListTemplate!C54","v":1000.01}]
[{"$f":"TypeListTemplate!A55","v":1676.27732332037},{"$f":"TypeListTemplate!B55","v":1250},{"$f":"TypeListTemplate!C55","v":1120.01}]
[{"$f":"TypeListTemplate!A56","v":1877.4306021188145},{"$f":"TypeListTemplate!B56","v":1400},{"$f":"TypeListTemplate!C56","v":1250.01}]
[{"$f":"TypeListTemplate!A57","v":2145.6349738500735},{"$f":"TypeListTemplate!B57","v":1600},{"$f":"TypeListTemplate!C57","v":1400.01}]
[{"$f":"TypeListTemplate!A58","v":2346.7882526485182},{"$f":"TypeListTemplate!B58","v":1750},{"$f":"TypeListTemplate!C58","v":1600.01}]
[{"$f":"TypeListTemplate!A59","v":2413.839345581333},{"$f":"TypeListTemplate!B59","v":1800},{"$f":"TypeListTemplate!C59","v":1750.01}]
[{"$f":"TypeListTemplate!A60","v":2682.043717312592},{"$f":"TypeListTemplate!B60","v":2000},{"$f":"TypeListTemplate!C60","v":1800.01}]
[{"$f":"TypeListTemplate!A61","v":2950.2480890438515},{"$f":"TypeListTemplate!B61","v":2200},{"$f":"TypeListTemplate!C61","v":2000.01}]
[{"$f":"TypeListTemplate!A62","v":3017.2991819766662},{"$f":"TypeListTemplate!B62","v":2250},{"$f":"TypeListTemplate!C62","v":2200.0100000000002}]
[{"$f":"TypeListTemplate!A63","v":3084.350274909481},{"$f":"TypeListTemplate!B63","v":2300},{"$f":"TypeListTemplate!C63","v":2250.0100000000002}]
[{"$f":"TypeListTemplate!A64","v":3352.55464664074},{"$f":"TypeListTemplate!B64","v":2500},{"$f":"TypeListTemplate!C64","v":2300.0100000000002}]
[{"$f":"TypeListTemplate!A65","v":3754.861204237629},{"$f":"TypeListTemplate!B65","v":2800},{"$f":"TypeListTemplate!C65","v":2500.0100000000002}]
[{"$f":"TypeListTemplate!A66","v":4224.2188547673322},{"$f":"TypeListTemplate!B66","v":3150},{"$f":"TypeListTemplate!C66","v":2800.01}]
[{"$f":"TypeListTemplate!A67","v":4760.6275982298512},{"$f":"TypeListTemplate!B67","v":3550},{"$f":"TypeListTemplate!C67","v":3150.01}]
[{"$f":"TypeListTemplate!A68","v":5364.087434625184},{"$f":"TypeListTemplate!B68","v":4000},{"$f":"TypeListTemplate!C68","v":3550.01}]
[{"$f":"TypeListTemplate!A69","v":6034.5983639533324},{"$f":"TypeListTemplate!B69","v":4500},{"$f":"TypeListTemplate!C69","v":4000.01}]
[{"$f":"TypeListTemplate!A70","v":6705.1092932814799},{"$f":"TypeListTemplate!B70","v":5000},{"$f":"TypeListTemplate!C70","v":4500.01}]
[{"$f":"TypeListTemplate!A71","v":0},{"$f":"TypeListTemplate!B71","v":999999999},{"$f":"TypeListTemplate!C71","v":5000.01}]
[{"$f":"TypeListTemplate!A72","v":0},{"$f":"TypeListTemplate!B72","v":0},{"$f":"TypeListTemplate!C72","v":0}]
[{"$f":"TypeListTemplate!A73","v":0},{"$f":"TypeListTemplate!B73","v":0},{"$f":"TypeListTemplate!C73","v":0},{"$f":"TypeListTemplate!D73","v":"Drive type"},{"$f":"TypeListTemplate!E73","v":0},{"$f":"TypeListTemplate!F73","v":"Drive type"},{"$f":"TypeListTemplate!G73","v":0},{"$f":"TypeListTemplate!H73","v":"Drive type"},{"$f":"TypeListTemplate!I73","v":0},{"$f":"TypeListTemplate!J73","v":"Drive type"},{"$f":"TypeListTemplate!K73","v":0},{"$f":"TypeListTemplate!L73","v":"Drive type"},{"$f":"TypeListTemplate!M73","v":0},{"$f":"TypeListTemplate!N73","v":"Drive type"},{"$f":"TypeListTemplate!O73","v":0},{"$f":"TypeListTemplate!P73","v":"Drive type"},{"$f":"TypeListTemplate!Q73","v":0}]
[{"$f":"TypeListTemplate!A74","v":0},{"$f":"TypeListTemplate!B74","v":0},{"$f":"TypeListTemplate!C74","v":0},{"$f":"TypeListTemplate!D74","v":" 115 V (1-ph)"},{"$f":"TypeListTemplate!E74","v":0},{"$f":"TypeListTemplate!F74","v":" 230 V (1-ph)"},{"$f":"TypeListTemplate!G74","v":0},{"$f":"TypeListTemplate!H74","v":" 230 V (3-ph)"},{"$f":"TypeListTemplate!I74","v":0},{"$f":"TypeListTemplate!J74","v":" 400 V"},{"$f":"TypeListTemplate!K74","v":0},{"$f":"TypeListTemplate!L74","v":" 460 V"},{"$f":"TypeListTemplate!M74","v":0},{"$f":"TypeListTemplate!N74","v":" 500 V"},{"$f":"TypeListTemplate!O74","v":0},{"$f":"TypeListTemplate!P74","v":" 690 V"},{"$f":"TypeListTemplate!Q74","v":0}]
[{"$f":"TypeListTemplate!A75","v":0},{"$f":"TypeListTemplate!B75","v":0},{"$f":"TypeListTemplate!C75","v":0},{"$f":"TypeListTemplate!D75","v":0},{"$f":"TypeListTemplate!E75","v":0},{"$f":"TypeListTemplate!F75","v":0},{"$f":"TypeListTemplate!G75","v":0},{"$f":"TypeListTemplate!H75","v":0},{"$f":"TypeListTemplate!I75","v":0},{"$f":"TypeListTemplate!J75","v":0},{"$f":"TypeListTemplate!K75","v":0},{"$f":"TypeListTemplate!L75","v":0},{"$f":"TypeListTemplate!M75","v":0},{"$f":"TypeListTemplate!N75","v":0},{"$f":"TypeListTemplate!O75","v":0},{"$f":"TypeListTemplate!P75","v":0},{"$f":"TypeListTemplate!Q75","v":0}]
[{"$f":"TypeListTemplate!A76","v":0},{"$f":"TypeListTemplate!B76","v":0},{"$f":"TypeListTemplate!C76","v":0},{"$f":"TypeListTemplate!D76","v":0},{"$f":"TypeListTemplate!E76","v":0},{"$f":"TypeListTemplate!F76","v":0},{"$f":"TypeListTemplate!G76","v":0},{"$f":"TypeListTemplate!H76","v":0},{"$f":"TypeListTemplate!I76","v":0},{"$f":"TypeListTemplate!J76","v":0},{"$f":"TypeListTemplate!K76","v":0},{"$f":"TypeListTemplate!L76","v":0},{"$f":"TypeListTemplate!M76","v":0},{"$f":"TypeListTemplate!N76","v":0},{"$f":"TypeListTemplate!O76","v":0},{"$f":"TypeListTemplate!P76","v":0},{"$f":"TypeListTemplate!Q76","v":0}]
[{"$f":"TypeListTemplate!A77","v":0},{"$f":"TypeListTemplate!B77","v":0},{"$f":"TypeListTemplate!C77","v":0},{"$f":"TypeListTemplate!D77","v":0},{"$f":"TypeListTemplate!E77","v":0},{"$f":"TypeListTemplate!F77","v":0},{"$f":"TypeListTemplate!G77","v":0},{"$f":"TypeListTemplate!H77","v":0},{"$f":"TypeListTemplate!I77","v":0},{"$f":"TypeListTemplate!J77","v":0},{"$f":"TypeListTemplate!K77","v":0},{"$f":"TypeListTemplate!L77","v":0},{"$f":"TypeListTemplate!M77","v":0},{"$f":"TypeListTemplate!N77","v":0},{"$f":"TypeListTemplate!O77","v":0},{"$f":"TypeListTemplate!P77","v":0},{"$f":"TypeListTemplate!Q77","v":0}]
[{"$f":"TypeListTemplate!A78","v":0},{"$f":"TypeListTemplate!B78","v":0},{"$f":"TypeListTemplate!C78","v":0},{"$f":"TypeListTemplate!D78","v":0},{"$f":"TypeListTemplate!E78","v":0},{"$f":"TypeListTemplate!F78","v":0},{"$f":"TypeListTemplate!G78","v":0},{"$f":"TypeListTemplate!H78","v":0},{"$f":"TypeListTemplate!I78","v":0},{"$f":"TypeListTemplate!J78","v":0},{"$f":"TypeListTemplate!K78","v":0},{"$f":"TypeListTemplate!L78","v":0},{"$f":"TypeListTemplate!M78","v":0},{"$f":"TypeListTemplate!N78","v":0},{"$f":"TypeListTemplate!O78","v":0},{"$f":"TypeListTemplate!P78","v":0},{"$f":"TypeListTemplate!Q78","v":0}]
[{"$f":"TypeListTemplate!A79","v":0},{"$f":"TypeListTemplate!B79","v":0},{"$f":"TypeListTemplate!C79","v":0},{"$f":"TypeListTemplate!D79","v":0},{"$f":"TypeListTemplate!E79","v":0},{"$f":"TypeListTemplate!F79","v":0},{"$f":"TypeListTemplate!G79","v":0},{"$f":"TypeListTemplate!H79","v":0},{"$f":"TypeListTemplate!I79","v":0},{"$f":"TypeListTemplate!J79","v":0},{"$f":"TypeListTemplate!K79","v":0},{"$f":"TypeListTemplate!L79","v":0},{"$f":"TypeListTemplate!M79","v":0},{"$f":"TypeListTemplate!N79","v":0},{"$f":"TypeListTemplate!O79","v":0},{"$f":"TypeListTemplate!P79","v":0},{"$f":"TypeListTemplate!Q79","v":0}]
[{"$f":"TypeListTemplate!A80","v":0},{"$f":"TypeListTemplate!B80","v":0},{"$f":"TypeListTemplate!C80","v":0},{"$f":"TypeListTemplate!D80","v":0},{"$f":"TypeListTemplate!E80","v":0},{"$f":"TypeListTemplate!F80","v":0},{"$f":"TypeListTemplate!G80","v":0},{"$f":"TypeListTemplate!H80","v":0},{"$f":"TypeListTemplate!I80","v":0},{"$f":"TypeListTemplate!J80","v":0},{"$f":"TypeListTemplate!K80","v":0},{"$f":"TypeListTemplate!L80","v":0},{"$f":"TypeListTemplate!M80","v":0},{"$f":"TypeListTemplate!N80","v":0},{"$f":"TypeListTemplate!O80","v":0},{"$f":"TypeListTemplate!P80","v":0},{"$f":"TypeListTemplate!Q80","v":0}]
[{"$f":"TypeListTemplate!A81","v":0},{"$f":"TypeListTemplate!B81","v":0},{"$f":"TypeListTemplate!C81","v":0},{"$f":"TypeListTemplate!D81","v":0},{"$f":"TypeListTemplate!E81","v":0},{"$f":"TypeListTemplate!F81","v":0},{"$f":"TypeListTemplate!G81","v":0},{"$f":"TypeListTemplate!H81","v":0},{"$f":"TypeListTemplate!I81","v":0},{"$f":"TypeListTemplate!J81","v":0},{"$f":"TypeListTemplate!K81","v":0},{"$f":"TypeListTemplate!L81","v":0},{"$f":"TypeListTemplate!M81","v":0},{"$f":"TypeListTemplate!N81","v":0},{"$f":"TypeListTemplate!O81","v":0},{"$f":"TypeListTemplate!P81","v":0},{"$f":"TypeListTemplate!Q81","v":0}]
[{"$f":"TypeListTemplate!A82","v":0},{"$f":"TypeListTemplate!B82","v":0},{"$f":"TypeListTemplate!C82","v":0},{"$f":"TypeListTemplate!D82","v":0},{"$f":"TypeListTemplate!E82","v":0},{"$f":"TypeListTemplate!F82","v":0},{"$f":"TypeListTemplate!G82","v":0},{"$f":"TypeListTemplate!H82","v":0},{"$f":"TypeListTemplate!I82","v":0},{"$f":"TypeListTemplate!J82","v":0},{"$f":"TypeListTemplate!K82","v":0},{"$f":"TypeListTemplate!L82","v":0},{"$f":"TypeListTemplate!M82","v":0},{"$f":"TypeListTemplate!N82","v":0},{"$f":"TypeListTemplate!O82","v":0},{"$f":"TypeListTemplate!P82","v":0},{"$f":"TypeListTemplate!Q82","v":0}]
[{"$f":"TypeListTemplate!A83","v":0},{"$f":"TypeListTemplate!B83","v":0},{"$f":"TypeListTemplate!C83","v":0},{"$f":"TypeListTemplate!D83","v":0},{"$f":"TypeListTemplate!E83","v":0},{"$f":"TypeListTemplate!F83","v":0},{"$f":"TypeListTemplate!G83","v":0},{"$f":"TypeListTemplate!H83","v":0},{"$f":"TypeListTemplate!I83","v":0},{"$f":"TypeListTemplate!J83","v":0},{"$f":"TypeListTemplate!K83","v":0},{"$f":"TypeListTemplate!L83","v":0},{"$f":"TypeListTemplate!M83","v":0},{"$f":"TypeListTemplate!N83","v":0},{"$f":"TypeListTemplate!O83","v":0},{"$f":"TypeListTemplate!P83","v":0},{"$f":"TypeListTemplate!Q83","v":0}]
[{"$f":"TypeListTemplate!A84","v":0},{"$f":"TypeListTemplate!B84","v":0},{"$f":"TypeListTemplate!C84","v":0},{"$f":"TypeListTemplate!D84","v":0},{"$f":"TypeListTemplate!E84","v":0},{"$f":"TypeListTemplate!F84","v":0},{"$f":"TypeListTemplate!G84","v":0},{"$f":"TypeListTemplate!H84","v":0},{"$f":"TypeListTemplate!I84","v":0},{"$f":"TypeListTemplate!J84","v":0},{"$f":"TypeListTemplate!K84","v":0},{"$f":"TypeListTemplate!L84","v":0},{"$f":"TypeListTemplate!M84","v":0},{"$f":"TypeListTemplate!N84","v":0},{"$f":"TypeListTemplate!O84","v":0},{"$f":"TypeListTemplate!P84","v":0},{"$f":"TypeListTemplate!Q84","v":0}]
[{"$f":"TypeListTemplate!A85","v":0},{"$f":"TypeListTemplate!B85","v":0},{"$f":"TypeListTemplate!C85","v":0},{"$f":"TypeListTemplate!D85","v":0},{"$f":"TypeListTemplate!E85","v":0},{"$f":"TypeListTemplate!F85","v":0},{"$f":"TypeListTemplate!G85","v":0},{"$f":"TypeListTemplate!H85","v":0},{"$f":"TypeListTemplate!I85","v":0},{"$f":"TypeListTemplate!J85","v":0},{"$f":"TypeListTemplate!K85","v":0},{"$f":"TypeListTemplate!L85","v":0},{"$f":"TypeListTemplate!M85","v":0},{"$f":"TypeListTemplate!N85","v":0},{"$f":"TypeListTemplate!O85","v":0},{"$f":"TypeListTemplate!P85","v":0},{"$f":"TypeListTemplate!Q85","v":0}]
[{"$f":"TypeListTemplate!A86","v":0},{"$f":"TypeListTemplate!B86","v":0},{"$f":"TypeListTemplate!C86","v":0},{"$f":"TypeListTemplate!D86","v":0},{"$f":"TypeListTemplate!E86","v":0},{"$f":"TypeListTemplate!F86","v":0},{"$f":"TypeListTemplate!G86","v":0},{"$f":"TypeListTemplate!H86","v":0},{"$f":"TypeListTemplate!I86","v":0},{"$f":"TypeListTemplate!J86","v":0},{"$f":"TypeListTemplate!K86","v":0},{"$f":"TypeListTemplate!L86","v":0},{"$f":"TypeListTemplate!M86","v":0},{"$f":"TypeListTemplate!N86","v":0},{"$f":"TypeListTemplate!O86","v":0},{"$f":"TypeListTemplate!P86","v":0},{"$f":"TypeListTemplate!Q86","v":0}]
[{"$f":"TypeListTemplate!A87","v":0},{"$f":"TypeListTemplate!B87","v":0},{"$f":"TypeListTemplate!C87","v":0},{"$f":"TypeListTemplate!D87","v":0},{"$f":"TypeListTemplate!E87","v":0},{"$f":"TypeListTemplate!F87","v":0},{"$f":"TypeListTemplate!G87","v":0},{"$f":"TypeListTemplate!H87","v":0},{"$f":"TypeListTemplate!I87","v":0},{"$f":"TypeListTemplate!J87","v":0},{"$f":"TypeListTemplate!K87","v":0},{"$f":"TypeListTemplate!L87","v":0},{"$f":"TypeListTemplate!M87","v":0},{"$f":"TypeListTemplate!N87","v":0},{"$f":"TypeListTemplate!O87","v":0},{"$f":"TypeListTemplate!P87","v":0},{"$f":"TypeListTemplate!Q87","v":0}]
[{"$f":"TypeListTemplate!A88","v":0},{"$f":"TypeListTemplate!B88","v":0},{"$f":"TypeListTemplate!C88","v":0},{"$f":"TypeListTemplate!D88","v":0},{"$f":"TypeListTemplate!E88","v":0},{"$f":"TypeListTemplate!F88","v":0},{"$f":"TypeListTemplate!G88","v":0},{"$f":"TypeListTemplate!H88","v":0},{"$f":"TypeListTemplate!I88","v":0},{"$f":"TypeListTemplate!J88","v":0},{"$f":"TypeListTemplate!K88","v":0},{"$f":"TypeListTemplate!L88","v":0},{"$f":"TypeListTemplate!M88","v":0},{"$f":"TypeListTemplate!N88","v":0},{"$f":"TypeListTemplate!O88","v":0},{"$f":"TypeListTemplate!P88","v":0},{"$f":"TypeListTemplate!Q88","v":0}]
[{"$f":"TypeListTemplate!A89","v":0},{"$f":"TypeListTemplate!B89","v":0},{"$f":"TypeListTemplate!C89","v":0},{"$f":"TypeListTemplate!D89","v":0},{"$f":"TypeListTemplate!E89","v":0},{"$f":"TypeListTemplate!F89","v":0},{"$f":"TypeListTemplate!G89","v":0},{"$f":"TypeListTemplate!H89","v":0},{"$f":"TypeListTemplate!I89","v":0},{"$f":"TypeListTemplate!J89","v":0},{"$f":"TypeListTemplate!K89","v":0},{"$f":"TypeListTemplate!L89","v":0},{"$f":"TypeListTemplate!M89","v":0},{"$f":"TypeListTemplate!N89","v":0},{"$f":"TypeListTemplate!O89","v":0},{"$f":"TypeListTemplate!P89","v":0},{"$f":"TypeListTemplate!Q89","v":0}]
[{"$f":"TypeListTemplate!A90","v":0},{"$f":"TypeListTemplate!B90","v":0},{"$f":"TypeListTemplate!C90","v":0},{"$f":"TypeListTemplate!D90","v":0},{"$f":"TypeListTemplate!E90","v":0},{"$f":"TypeListTemplate!F90","v":0},{"$f":"TypeListTemplate!G90","v":0},{"$f":"TypeListTemplate!H90","v":0},{"$f":"TypeListTemplate!I90","v":0},{"$f":"TypeListTemplate!J90","v":0},{"$f":"TypeListTemplate!K90","v":0},{"$f":"TypeListTemplate!L90","v":0},{"$f":"TypeListTemplate!M90","v":0},{"$f":"TypeListTemplate!N90","v":0},{"$f":"TypeListTemplate!O90","v":0},{"$f":"TypeListTemplate!P90","v":0},{"$f":"TypeListTemplate!Q90","v":0}]
[{"$f":"TypeListTemplate!A91","v":0},{"$f":"TypeListTemplate!B91","v":0},{"$f":"TypeListTemplate!C91","v":0},{"$f":"TypeListTemplate!D91","v":0},{"$f":"TypeListTemplate!E91","v":0},{"$f":"TypeListTemplate!F91","v":0},{"$f":"TypeListTemplate!G91","v":0},{"$f":"TypeListTemplate!H91","v":0},{"$f":"TypeListTemplate!I91","v":0},{"$f":"TypeListTemplate!J91","v":0},{"$f":"TypeListTemplate!K91","v":0},{"$f":"TypeListTemplate!L91","v":0},{"$f":"TypeListTemplate!M91","v":0},{"$f":"TypeListTemplate!N91","v":0},{"$f":"TypeListTemplate!O91","v":0},{"$f":"TypeListTemplate!P91","v":0},{"$f":"TypeListTemplate!Q91","v":0}]
[{"$f":"TypeListTemplate!A92","v":0},{"$f":"TypeListTemplate!B92","v":0},{"$f":"TypeListTemplate!C92","v":0},{"$f":"TypeListTemplate!D92","v":0},{"$f":"TypeListTemplate!E92","v":0},{"$f":"TypeListTemplate!F92","v":0},{"$f":"TypeListTemplate!G92","v":0},{"$f":"TypeListTemplate!H92","v":0},{"$f":"TypeListTemplate!I92","v":0},{"$f":"TypeListTemplate!J92","v":0},{"$f":"TypeListTemplate!K92","v":0},{"$f":"TypeListTemplate!L92","v":0},{"$f":"TypeListTemplate!M92","v":0},{"$f":"TypeListTemplate!N92","v":0},{"$f":"TypeListTemplate!O92","v":0},{"$f":"TypeListTemplate!P92","v":0},{"$f":"TypeListTemplate!Q92","v":0}]
[{"$f":"TypeListTemplate!A93","v":0},{"$f":"TypeListTemplate!B93","v":0},{"$f":"TypeListTemplate!C93","v":0},{"$f":"TypeListTemplate!D93","v":0},{"$f":"TypeListTemplate!E93","v":0},{"$f":"TypeListTemplate!F93","v":0},{"$f":"TypeListTemplate!G93","v":0},{"$f":"TypeListTemplate!H93","v":0},{"$f":"TypeListTemplate!I93","v":0},{"$f":"TypeListTemplate!J93","v":0},{"$f":"TypeListTemplate!K93","v":0},{"$f":"TypeListTemplate!L93","v":0},{"$f":"TypeListTemplate!M93","v":0},{"$f":"TypeListTemplate!N93","v":0},{"$f":"TypeListTemplate!O93","v":0},{"$f":"TypeListTemplate!P93","v":0},{"$f":"TypeListTemplate!Q93","v":0}]
[{"$f":"TypeListTemplate!A94","v":0},{"$f":"TypeListTemplate!B94","v":0},{"$f":"TypeListTemplate!C94","v":0},{"$f":"TypeListTemplate!D94","v":0},{"$f":"TypeListTemplate!E94","v":0},{"$f":"TypeListTemplate!F94","v":0},{"$f":"TypeListTemplate!G94","v":0},{"$f":"TypeListTemplate!H94","v":0},{"$f":"TypeListTemplate!I94","v":0},{"$f":"TypeListTemplate!J94","v":0},{"$f":"TypeListTemplate!K94","v":0},{"$f":"TypeListTemplate!L94","v":0},{"$f":"TypeListTemplate!M94","v":0},{"$f":"TypeListTemplate!N94","v":0},{"$f":"TypeListTemplate!O94","v":0},{"$f":"TypeListTemplate!P94","v":0},{"$f":"TypeListTemplate!Q94","v":0}]
[{"$f":"TypeListTemplate!A95","v":0},{"$f":"TypeListTemplate!B95","v":0},{"$f":"TypeListTemplate!C95","v":0},{"$f":"TypeListTemplate!D95","v":0},{"$f":"TypeListTemplate!E95","v":0},{"$f":"TypeListTemplate!F95","v":0},{"$f":"TypeListTemplate!G95","v":0},{"$f":"TypeListTemplate!H95","v":0},{"$f":"TypeListTemplate!I95","v":0},{"$f":"TypeListTemplate!J95","v":0},{"$f":"TypeListTemplate!K95","v":0},{"$f":"TypeListTemplate!L95","v":0},{"$f":"TypeListTemplate!M95","v":0},{"$f":"TypeListTemplate!N95","v":0},{"$f":"TypeListTemplate!O95","v":0},{"$f":"TypeListTemplate!P95","v":0},{"$f":"TypeListTemplate!Q95","v":0}]

{"sheet":"Language","index":9,"n_rows":111,"n_cols":10,"rows_kept":111,"cut":false,"hidden":true,"merged":[]}
["Field or component",null,null,"Content or default value"]
[null,"Chinese","Dutch","English","Finnish","French","German","Portuguese","Russian","Vietnamese"]
["Header_AppTitle","PumpSave 5.3","PumpSave 5.3","PumpSave 5.3","PumpSave 5.3","PumpSave 5.3","PumpSave 5.3","PumpSave 5.3","PumpSave 5.3","PumpSave 5.3"]
["Header_AppSubTitle","水泵节能计算工具","Calculatie energiebesparing voor pompen","Energy saving calculator for pumps","Energiansäästölaskuri pumpuille","Economies d'énergie pour pompes","Energiesparrechner für Pumpen","Cálculo de Economia de Energia","Расчет энергосбережения для насосов","Tính toán tiết kiệm năng lượng cho máy bơm"]
["Header_Pump","水泵","Pomp","Pump","Pumppu","Pompe","Pumpe","Bomba","насос","Máy bơm"]
["Label_NominalVolume","额定流量","Nominaal debiet","Nominal volume flow","Tilavuusvirta","Débit nominal","Nennvolumenstrom","Volume Fluxo nominal","Номинальный расход","Lưu lượng danh định"]
["Unit_NominalVolume",null,null,"m3/h",null,null,null,null,null,"m3/ giờ"]
["Label_NominalHead","额定扬程","Nominale opvoerhoogte","Nominal head","Nostokorkeus","P Pression nominale","Nenndruckhöhe","Perdas nominais (Hd)","Номинальный напор","Độ cao danh định"]
["Unit_NominalHead",null,null,"m"]
["Label_MaxHead","最大扬程","Maximale opvoerhoogte","Max head","Maksimi nostokorkeus","P max","Max. Druckhöhe","Perdas máximas (H)","Максимальный напор\\","Độ cao tối đa"]
["Unit_MaxHead",null,null,"m"]
["Label_Efficiency","水泵效率","Rendement","Efficiency","Hyötysuhde","Rendement","Wirkungsgrad ","Eficiência","КПД ","Hiệu suất"]
["Unit_Efficiency",null,null,"%"]
["Label_Liquid","液体密度","Vloeistof dichtheid","Liquid density","Nesteen tiheys","Densité du liquide","Flüssigkeitsdichte","Densidade do líquido","Плотность жидкости","Mật độ chất lỏng"]
["Unit_Liquid",null,null,"kg/m3"]
["Label_StaticHead","静态扬程","Dynamische opvoerhoogte","Static head","Stattinen nostokorkeus","HMT"," Statische Druckhöhe","Perdas dinâmicas (He)","Статический напор","Độ cao tĩnh"]
["Unit_StaticHead",null,null,"m"]
["Label_Existing","现有流量控制","Bestaande debietcontrole","Existing flow control","Nykyinen säätömenetelmä","Méthode de control actuelle","Bestehende Luftmengenregelung","Controle existente de fluxo","Существующий способ управления","Điều chỉnh lưu lượng hiện hành"]
["Header_Drive","传动和电机","Drive en motor","Drive and motor","Käyttö ja moottori","Drive et moteur","Antrieb und Motor","Drive motor","электропривод и двигатель","Biến tần và động cơ"]
["Label_Supply","电源电压","Voedingsspanning","Supply voltage","Syöttöjännite","Tension d'alimentation","Netzspannung ","Tensão de Alimentação","Напряжение питания","Điện áp nguồn"]
["Label_Required","电机需求功率","Benodigd motorvermogen","Required motor power","Moottorin teho","Pw utile moteur","Erforderliche Motorleistung","Potência do motor necessário:","Требуемая мощность двигателя","Công suất động cơ yêu cầu"]
["Unit_Required",null,null,"kW"]
["Label_MotorPower","电机功率","Motorvermogen","Motor power","Moottorin teho","Puissance moteur","Motorleistung","Potência do motor ","Мощность двигателя","Công suất động cơ"]
["Unit_MotorPower","kW","kW","kW","kW","kW","kW","kW","kW","kW"]
["Label_MotorEfficiency","电机效率","Motorrendement","Motor efficiency","Moottorin hyötysuhde","Rendement moteur","Motorwirkungsgrad","Eficiência do Motor","КПД двигателя","Hiệu suất động cơ"]
["Unit_MotorEfficiency",null,null,"%"]
["Label_Improved","使用如下变频器控制流量","Verbeterde debietcontrole met frequentieomvormer","Improved control by","Säätö AC käytöllä  ","Régulation de débit avec un variateur type","Verbesserte Regelung durch Frequenzumrichter","Melhoria do fluxo de controle com Inverosr","Управление с помощью ПЧ АББ ","Điều khiển được cải tiến cho"]
["Value_FrequencyConverter"]
["Header_FlowProfile","运行状况","Debiet profiel","Flow profile","Virtausprofiili","Débit profil","Durchfluss Profil","Vazão perfil","Рacxoд профиль","Biên dạng lưu lượng"]
["Label_Annual","年运行时间","Jaarlijkse draaitijd","Annual running time","Vuotuiset käyttötunnit","Fonctionnement annuel"," Jährliche Laufzeit ","Tempo de utilização anual","Время работы за год","Thời gian hoạt động hàng năm"]
["Unit_Annual","h","h","h","h","h","h","h","h","h"]
["Feedback_Annual","正常年为8760小时,润年为8784小时","Normal year is 8760 h, leap year 8784h","Normal year is 8760 h, leap year 8784h","Normal year is 8760 h, leap year 8784h","Normal year is 8760 h, leap year 8784h","Normal year is 8760 h, leap year 8784h","Normal year is 8760 h, leap year 8784h","Normal year is 8760 h, leap year 8784h","Năm dương lịch có 8760 giờ, năm nhuận có 8784 giờ"]
["Label_Flow","流量","Debiet profiel","Flow","Virtaama","Débit ","Durchfluss","VAZÃO ","РАСХОД","Lưu lượng"]
["Button_Default","缺省值","Standaard","DEFAULT","Oletus","Par défaut","Standard","Valor lOrigin","ТИПОВОЙ ЦИКЛ","MẶC ĐỊNH"]
["Spin_100"]
["Spin_90"]
["Spin_80"]
["Spin_70"]
["Spin_60"]
["Spin_50"]
["Spin_40"]
["Spin_30"]
["Spin_20"]
["Value_100"]
["Value_90"]
["Value_80"]
["Value_70"]
["Value_60"]
["Value_50"]
["Value_40"]
["Value_30"]
["Value_20"]
["Label_Sum",null,"Som"]
["Value_Sum",null,null,100]
["Feedback_Sum","和必须等于100%","Som moet 100% zijn","Sum must equal 100 % ","Sum must equal 100 % ","Sum must equal 100 % ","Sum must equal 100 % ","Sum must equal 100 % ","Sum must equal 100 % ","Tổng phải bằng 100 %"]
["Value_SumHours"]
["Value_Flow100"]
["Value_Flow90"]
["Value_Flow80"]
["Value_Flow70"]
["Value_Flow60"]
["Value_Flow50"]
["Value_Flow40"]
["Value_Flow30"]
["Value_Flow20"]
["Header_Economic","经济数据","Economische data","Economic data","Investoinnin tiedot","Données économiques","Betriebswirtschaftliche Daten  ","Dados Econômicos","Экономические показатели","Dữ liệu kinh tế"]
["Label_Currency","货币单位","Munteenheid","Currency unit","Valuutta","Unité monétaire","Währungseinheit","Moeda","Валюта","Đơn vị tiền tệ"]
["Label_Energy","电价","Energieprijs","Energy price","Energian hinta","Tarif énergie","Strompreis","O preço da energia","Цена электроэнергии","Giá năng lượng"]
["Unit_Energy","€/kWh","€/kWh","€/kWh","€/kWh","€/kWh","€/kWh","€/kWh","€/kWh","€/kWh"]
["Label_Investment","投资成本","Investeringskost","Investment cost","Investointikustannus","Coût d'investissement","Investitionskosten","Custo do investimento","Стоимость инвестиций","Chi phí đầu tư"]
["Unit_Investment",null,null,"€"]
["Label_Interest","利率","Interestvoet","Interest rate","Korkokanta","Taux d'intérêt","Zinssatz","Taxa de juros","% по кредиту","Lãi suất"]
["Unit_Interest",null,null,"%"]
["Label_CO2","CO2排放换算","CO2 emissie","CO2 emission","CO2 päästö","Emission CO2","CO2-Emissionen","Emissão de CO2","Выделение СО2","Lượng CO2/ đơn vị"]
["Unit_CO2",null,null,"kg/kWh"]
["Header_Calculated","计算结果","Berekende besparingen","Calculated savings","Energiansäästö","Economie d'énergie","Energieeinsparung","Economia de energia","Энергосбережение","Tiết kiệm đã tính toán"]
["Label_AnnualSaving","年节电","Jaarlijkse energiebesparing","Annual energy saving","Vuotuinen energiansäästö","Economie d'énergie / an","Jährliche Energieeinsparung","Economia de energia anual","Энергосбережение за год","Tiết kiệm năng lượng/ năm"]
["Value_AnnualSaving"]
["Unit_AnnualSaving",null,null,"MWh"]
["Header_Energy","年耗电","Energieverbruik","Energy consumption","Energiankulutus","Consommation d'énergie","Energieverbrauch","Consumo de Energia","Энергопотребление","Tiêu thụ năng lượng hàng năm:"]
["Label_EnergyExisting","使用现有控制方式","met bestaande controle","with existing control method","nykymenetelmällä","avec méthode actuelle","mit vorhandenem Regelungsverfahren","Método de controle atual","При существующем способе управления","Với điều khiển hiện hành"]
["Value_EnergyExisting"]
["Unit_EnergyExisting",null,null,"MWh"]
["Label_EnergyNew","使用ABB变频器控制","met ABB  frequentieregelaar","with new control by ABB drive","parannetulla menetelmällä","avec méthode variateur","mit verbessertem Regelungsverfahren","Método de controle otimizado","При предлагаемом способе управления","Với điều khiển được cải tiến"]
["Value_EnergyNew"]
["Unit_EnergyNew",null,null,"MWh"]
["Label_EnergySaving","节电百分比","Besparings percentage","Saving percentage","Säästö prosentteina","Pourcentage d'économie","Einsparung in %","Percentual de Econômia","Экономия в  %","Phần trăm tiết kiệm"]
["Value_EnergySaving"]
["Unit_EnergySaving",null,null,"%"]
["Value_PumpEnergy"]
["Unit_PumpEnergy",null,null,"kW/(m3/s)",null,null,null,null,null,"kW/(m3/ giây)"]
["Header_EconomicResults","经济数据","Economische resultaten","Economic Results","Investoinnin tiedot","Résultats d'économies","Betriebswirtschaftliche Daten","Resultados Econômicos","Экономические результаты","Kết quả kinh tế"]
["Label_EconomicAnnual","年均节省","Jaarlijkse besparing","Annual Saving","Vuosittainen säästö","Economie annuelle","Jährliche Einsparung","Economia anual","Годовая экономия","Tiết kiệm hàng năm"]
["Value_EconomicAnnual"]
["Unit_EconomicAnnual"]
["Label_EconomicPayback","投资回收期","Terugbetalingstermijn","Payback period","Takaisinmaksuaika","Retour sur investissement","Amortisierungsdauer","Retorno de Investimento","Срок окупаемости","Chu kỳ trả dần"]
["Value_EconomicPayback"]
["Unit_EconomicPayback","年","jaren","years","vuotta","années","Jahre","anos","год","năm"]
["Label_EconomicCO2","年减排CO2","CO2 besparing","CO2 reduction","CO2 alenema ","Réduction CO2","CO2-Reduzierung","Redução CO2","сокращение выбросов CO2","Lượng giảm khí CO2 hàng năm"]
["Value_EconomicCO2"]
["Unit_EconomicCO2","t/年","ton/jaar","t/year","t/vuosi","t/l'année","t/jahr","t/ano","t/год","t/ năm"]
["Button_Copy","拷贝产品型号并存储数据","Copy product and savings data","Copy product and savings data","Copy product and savings data","Copy product and savings data","Copy product and savings data","Copy product and savings data","Copy product and savings data","Sao lưu sản phẩm và tiết kiệm dữ liệu"]
["Link_Disclaimer","承诺","Disclaimer","Disclaimer","Disclaimer","Disclaimer","Disclaimer","Disclaimer","Disclaimer","Disclaimer"]
["Label_Ref","参考：","Ref:","Ref:","Ref:","Ref:","Ref:","Ref:","Ref:","Tham chiếu:"]
["Input_Ref","水泵ID","Pomp ID","PumpID","Pumpun tunniste","Référence pompe","Pumpen-ID","Identificação da Bomba :","№ насосного агрегата","ID của máy bơm"]
["ComboBox_ExistingFlowCtrl","节流控制","debiet controle dmv smoorklep","Throttling control","Kuristussäätö","Régulation par vanne","Drosselregelung","Controle por estrangulamento","Управление задвижкой","Điều chỉnh tiết lưu"]
["ComboBox_ExistingFlowCtrl","起/停控制","Aan/uit controle","On/off control","On/Off säätö","Régulation en \"tout ou rien\"","EIN/AUS-Steuerung","Controle on / off","Управление ВКЛ/ВЫКЛ","Bật/ tắt điều khiển"]
["ComboBox_ExistingFlowCtrl","液力耦合控制","Hydraulische controle","Hydraulic control","Jättämäsäätö","Régulation par coupleur hydraulique","Hydraulische Regelung","Controle hidráulico","Гидравлическое управление","Điều khiển bằng thủy lực"]
["ComboBox_CurrencyUnit","€","€","€","€","€","€","€","€","€"]
["ComboBox_CurrencyUnit","£","£","£","£","£","£","£","£","£"]
["ComboBox_CurrencyUnit","$","$","$","$","$","$","$","$","$"]

{"sheet":"ACS800","index":10,"n_rows":95,"n_cols":17,"rows_kept":95,"cut":false,"hidden":true,"merged":[]}
["Typecode","Prod.class",null,"Voltage range 1",null,"Voltage range 2 (1-ph)",null,"Voltage range 2",null,"Voltage range 3",null,"Voltage range 4.6",null,"Voltage range 5",null,"Voltage range 7/6"]
[{"$f":"VLOOKUP(DriveSel!E20,C8:Y71,DriveSel!D18)","v":"ACS800-01-0165-3"},{"$f":"VLOOKUP(#REF!,C8:X70,7)","v":{"$error":"#REF!"}},"non-US (50Hz)"," 115 V (1-ph)",null," 230 V (1-ph)",null," 230 V (3-ph)",null," 400 V",null," 460 V",null," 500 V",null," 690 V"]
["Col.ordinal","Col.ordinal"]
[null,null,"Alternatives:","115 V 1-ph",null,"200/208/230/240 V 1-ph",null,"200/208/230/240 V 3-ph",null,"380/400/415 V",null,"440/460/480 V",null,"500 V",null,"525/550/575/600/660/690 V"]
["Motor Power","Motor",null,"Drive type",null,"Drive type",null,"Drive type",null,"Drive type",null,"Drive type",null,"Drive type",null,"Drive type"]
[{"$f":"TypeListTemplate!A6","v":"Hp"},{"$f":"TypeListTemplate!B6","v":"power kW"}]
[{"$f":"TypeListTemplate!A7","v":0},{"$f":"TypeListTemplate!B7","v":"Column Ordinal ->"},{"$f":"TypeListTemplate!C7","v":1},{"$f":"TypeListTemplate!D7","v":2},{"$f":"TypeListTemplate!E7","v":3},{"$f":"TypeListTemplate!F7","v":4},{"$f":"TypeListTemplate!G7","v":5},{"$f":"TypeListTemplate!H7","v":6},{"$f":"TypeListTemplate!I7","v":7},{"$f":"TypeListTemplate!J7","v":8},{"$f":"TypeListTemplate!K7","v":9},{"$f":"TypeListTemplate!L7","v":10},{"$f":"TypeListTemplate!M7","v":11},{"$f":"TypeListTemplate!N7","v":12},{"$f":"TypeListTemplate!O7","v":13},{"$f":"TypeListTemplate!P7","v":14},{"$f":"TypeListTemplate!Q7","v":15}]
[{"$f":"TypeListTemplate!A8","v":0},{"$f":"TypeListTemplate!B8","v":0},{"$f":"TypeListTemplate!C8","v":0}]
[{"$f":"TypeListTemplate!A9","v":7.3756202226096287E-2},{"$f":"TypeListTemplate!B9","v":5.5E-2},{"$f":"TypeListTemplate!C9","v":0.01}]
[{"$f":"TypeListTemplate!A10","v":0.12069196727906664},{"$f":"TypeListTemplate!B10","v":0.09},{"$f":"TypeListTemplate!C10","v":6.5000000000000002E-2}]
[{"$f":"TypeListTemplate!A11","v":0.16092262303875551},{"$f":"TypeListTemplate!B11","v":0.12},{"$f":"TypeListTemplate!C11","v":9.9999999999999992E-2}]
[{"$f":"TypeListTemplate!A12","v":0.24138393455813328},{"$f":"TypeListTemplate!B12","v":0.18},{"$f":"TypeListTemplate!C12","v":0.13}]
[{"$f":"TypeListTemplate!A13","v":0.49617808770282951},{"$f":"TypeListTemplate!B13","v":0.37},{"$f":"TypeListTemplate!C13","v":0.19}]
[{"$f":"TypeListTemplate!A14","v":0.7375620222609629},{"$f":"TypeListTemplate!B14","v":0.55000000000000004},{"$f":"TypeListTemplate!C14","v":0.38},null,null,null,null,"ACS800-01-0001-2"]
[{"$f":"TypeListTemplate!A15","v":1.0057663939922221},{"$f":"TypeListTemplate!B15","v":0.75},{"$f":"TypeListTemplate!C15","v":0.56000000000000005},null,null,null,null,"ACS800-01-0001-2"]
[{"$f":"TypeListTemplate!A16","v":1.4751240445219258},{"$f":"TypeListTemplate!B16","v":1.1000000000000001},{"$f":"TypeListTemplate!C16","v":0.76},null,null,null,null,"ACS800-01-0001-2","wall-mounted","ACS800-01-0003-3",null,"ACS800-01-0004-5",null,"ACS800-01-0004-5"]
[{"$f":"TypeListTemplate!A17","v":2.0115327879844442},{"$f":"TypeListTemplate!B17","v":1.5},{"$f":"TypeListTemplate!C17","v":1.1100000000000001},null,null,null,null,"ACS800-01-0002-2","wall-mounted","ACS800-01-0003-3",null,"ACS800-01-0004-5",null,"ACS800-01-0004-5"]
[{"$f":"TypeListTemplate!A18","v":2.9502480890438516},{"$f":"TypeListTemplate!B18","v":2.2000000000000002},{"$f":"TypeListTemplate!C18","v":1.51},null,null,null,null,"ACS800-01-0004-2","wall-mounted","ACS800-01-0004-3",null,"ACS800-01-0004-5",null,"ACS800-01-0004-5"]
[{"$f":"TypeListTemplate!A19","v":4.0230655759688885},{"$f":"TypeListTemplate!B19","v":3},{"$f":"TypeListTemplate!C19","v":2.21},null,null,null,null,"ACS800-01-0005-2","wall-mounted","ACS800-01-0005-3",null,"ACS800-01-0005-5",null,"ACS800-01-0005-5"]
[{"$f":"TypeListTemplate!A20","v":5},{"$f":"TypeListTemplate!B20","v":3.7285000000000004},{"$f":"TypeListTemplate!C20","v":3.01},null,null,null,null,"ACS800-01-0006-2",null,"ACS800-01-0006-3",null,"ACS800-01-0006-5",null,"ACS800-01-0006-5"]
[{"$f":"TypeListTemplate!A21","v":5.3640874346251843},{"$f":"TypeListTemplate!B21","v":4},{"$f":"TypeListTemplate!C21","v":3.7385000000000002},null,null,null,null,"ACS800-01-0006-2","wall-mounted","ACS800-01-0006-3",null,"ACS800-01-0006-5",null,"ACS800-01-0006-5"]
[{"$f":"TypeListTemplate!A22","v":7.3756202226096281},{"$f":"TypeListTemplate!B22","v":5.5},{"$f":"TypeListTemplate!C22","v":4.01},null,null,null,null,"ACS800-01-0009-2","wall-mounted","ACS800-01-0009-3",null,"ACS800-01-0009-5",null,"ACS800-01-0009-5",null,"ACS800-01-0011-7"]
[{"$f":"TypeListTemplate!A23","v":10.05766393992222},{"$f":"TypeListTemplate!B23","v":7.5},{"$f":"TypeListTemplate!C23","v":5.51},null,null,null,null,"ACS800-01-0011-2","wall-mounted","ACS800-01-0011-3",null,"ACS800-01-0011-5",null,"ACS800-01-0011-5",null,"ACS800-01-0011-7"]
[{"$f":"TypeListTemplate!A24","v":14.751240445219256},{"$f":"TypeListTemplate!B24","v":11},{"$f":"TypeListTemplate!C24","v":7.51},null,null,null,null,"ACS800-01-0016-2","wall-mounted","ACS800-01-0016-3",null,"ACS800-01-0016-5",null,"ACS800-01-0016-5",null,"ACS800-01-0011-7"]
[{"$f":"TypeListTemplate!A25","v":20.11532787984444},{"$f":"TypeListTemplate!B25","v":15},{"$f":"TypeListTemplate!C25","v":11.01},null,null,null,null,"ACS800-01-0020-2","wall-mounted","ACS800-01-0020-3",null,"ACS800-01-0020-5",null,"ACS800-01-0020-5",null,"ACS800-01-0016-7"]
[{"$f":"TypeListTemplate!A26","v":24.808904385141478},{"$f":"TypeListTemplate!B26","v":18.5},{"$f":"TypeListTemplate!C26","v":15.01},null,null,null,null,"ACS800-01-0025-2","wall-mounted","ACS800-01-0025-3",null,"ACS800-01-0025-5",null,"ACS800-01-0025-5",null,"ACS800-01-0020-7"]
[{"$f":"TypeListTemplate!A27","v":29.502480890438513},{"$f":"TypeListTemplate!B27","v":22},{"$f":"TypeListTemplate!C27","v":18.510000000000002},null,null,null,null,"ACS800-01-0030-2","wall-mounted","ACS800-01-0025-3",null,"ACS800-01-0030-5",null,"ACS800-01-0030-5",null,"ACS800-01-0025-7"]
[{"$f":"TypeListTemplate!A28","v":40.230655759688879},{"$f":"TypeListTemplate!B28","v":30},{"$f":"TypeListTemplate!C28","v":22.01},null,null,null,null,"ACS800-01-0040-2","wall-mounted","ACS800-01-0030-3",null,"ACS800-01-0040-5",null,"ACS800-01-0040-5",null,"ACS800-01-0030-7"]
[{"$f":"TypeListTemplate!A29","v":49.617808770282956},{"$f":"TypeListTemplate!B29","v":37},{"$f":"TypeListTemplate!C29","v":30.01},null,null,null,null,"ACS800-01-0050-2","wall-mounted","ACS800-01-0040-3",null,"ACS800-01-0050-5",null,"ACS800-01-0050-5",null,"ACS800-01-0050-7"]
[{"$f":"TypeListTemplate!A30","v":60.345983639533323},{"$f":"TypeListTemplate!B30","v":45},{"$f":"TypeListTemplate!C30","v":37.01},null,null,null,null,"ACS800-01-0060-2","wall-mounted","ACS800-01-0050-3",null,"ACS800-01-0060-5",null,"ACS800-01-0060-5",null,"ACS800-01-0050-7"]
[{"$f":"TypeListTemplate!A31","v":73.756202226096278},{"$f":"TypeListTemplate!B31","v":55},{"$f":"TypeListTemplate!C31","v":45.01},null,null,null,null,"ACS800-01-0070-2","wall-mounted","ACS800-01-0060-3",null,"ACS800-01-0070-5",null,"ACS800-01-0070-5",null,"ACS800-01-0060-7"]
[{"$f":"TypeListTemplate!A32","v":100.5766393992222},{"$f":"TypeListTemplate!B32","v":75},{"$f":"TypeListTemplate!C32","v":55.01},null,null,null,null,"ACS800-02-0100-2","free-standing","ACS800-01-0075-3",null,"ACS800-01-0105-5",null,"ACS800-01-0105-5",null,"ACS800-01-0070-7"]
[{"$f":"TypeListTemplate!A33","v":120.69196727906665},{"$f":"TypeListTemplate!B33","v":90},{"$f":"TypeListTemplate!C33","v":75.010000000000005},null,null,null,null,"ACS800-02-0120-2","free-standing","ACS800-01-0100-3",null,"ACS800-01-0105-5",null,"ACS800-01-0105-5",null,"ACS800-01-0100-7"]
[{"$f":"TypeListTemplate!A34","v":147.51240445219256},{"$f":"TypeListTemplate!B34","v":110},{"$f":"TypeListTemplate!C34","v":90.01},null,null,null,null,"ACS800-02-0140-2","free-standing","ACS800-01-0120-3",null,"ACS800-01-0140-5",null,"ACS800-01-0140-5",null,"ACS800-01-0120-7"]
[{"$f":"TypeListTemplate!A35","v":177.01488534263109},{"$f":"TypeListTemplate!B35","v":132},{"$f":"TypeListTemplate!C35","v":110.01},null,null,null,null,"ACS800-02-0170-2","free-standing","ACS800-01-0165-3",null,"ACS800-01-0165-5",null,"ACS800-01-0165-5",null,"ACS800-01-0145-7"]
[{"$f":"TypeListTemplate!A36","v":200},{"$f":"TypeListTemplate!B36","v":149.14000000000001},{"$f":"TypeListTemplate!C36","v":132.01},null,null,null,null,"ACS800-02-0210-2",null,"ACS800-01-0205-3",null,"ACS800-01-0205-5",null,"ACS800-01-0205-5",null,"ACS800-01-0175-7"]
[{"$f":"TypeListTemplate!A37","v":214.56349738500737},{"$f":"TypeListTemplate!B37","v":160},{"$f":"TypeListTemplate!C37","v":149.15},null,null,null,null,"ACS800-02-0210-2","free-standing","ACS800-01-0205-3",null,"ACS800-01-0205-5",null,"ACS800-01-0205-5",null,"ACS800-01-0175-7"]
[{"$f":"TypeListTemplate!A38","v":250},{"$f":"TypeListTemplate!B38","v":186.42500000000001},{"$f":"TypeListTemplate!C38","v":160.01},null,null,null,null,"ACS800-02-0260-2","free-standing","ACS800-02-0260-3",null,"ACS800-01-0255-5",null,"ACS800-01-0255-5",null,"ACS800-02-0260-7"]
[{"$f":"TypeListTemplate!A39","v":268.20437173125919},{"$f":"TypeListTemplate!B39","v":200},{"$f":"TypeListTemplate!C39","v":186.435},null,null,null,null,"ACS800-02-0260-2","free-standing","ACS800-02-0260-3",null,"ACS800-01-0255-5",null,"ACS800-01-0255-5",null,"ACS800-02-0260-7"]
[{"$f":"TypeListTemplate!A40","v":300},{"$f":"TypeListTemplate!B40","v":223.71},{"$f":"TypeListTemplate!C40","v":200.01},null,null,null,null,null,null,"ACS800-02-0320-3",null,"ACS800-02-0320-5",null,"ACS800-02-0320-5",null,"ACS800-02-0320-7"]
[{"$f":"TypeListTemplate!A41","v":335.255464664074},{"$f":"TypeListTemplate!B41","v":250},{"$f":"TypeListTemplate!C41","v":223.72},null,null,null,null,null,null,"ACS800-02-0320-3",null,"ACS800-02-0320-5",null,"ACS800-02-0320-5",null,"ACS800-02-0320-7"]
[{"$f":"TypeListTemplate!A42","v":400},{"$f":"TypeListTemplate!B42","v":298.28000000000003},{"$f":"TypeListTemplate!C42","v":250.01},null,null,null,null,null,null,"ACS800-02-0400-3",null,"ACS800-02-0400-5",null,"ACS800-02-0400-5",null,"ACS800-02-0320-7"]
[{"$f":"TypeListTemplate!A43","v":422.42188547673328},{"$f":"TypeListTemplate!B43","v":315},{"$f":"TypeListTemplate!C43","v":298.29000000000002},null,null,null,null,null,null,"ACS800-02-0400-3",null,"ACS800-02-0400-5",null,"ACS800-02-0400-5",null,"ACS800-02-0320-7"]
[{"$f":"TypeListTemplate!A44","v":476.06275982298507},{"$f":"TypeListTemplate!B44","v":355},{"$f":"TypeListTemplate!C44","v":315.01},null,null,null,null,null,null,"ACS800-02-0440-3",null,"ACS800-02-0440-5",null,"ACS800-02-0440-5",null,"ACS800-02-0400-7"]
[{"$f":"TypeListTemplate!A45","v":536.40874346251837},{"$f":"TypeListTemplate!B45","v":400},{"$f":"TypeListTemplate!C45","v":355.01},null,null,null,null,null,null,"ACS800-02-0490-3",null,"ACS800-02-0490-5",null,"ACS800-02-0490-5",null,"ACS800-02-0440-7"]
[{"$f":"TypeListTemplate!A46","v":603.45983639533324},{"$f":"TypeListTemplate!B46","v":450},{"$f":"TypeListTemplate!C46","v":400.01},null,null,null,null,null,null,"ACS800-07-0610-3",null,"ACS800-02-0550-5",null,"ACS800-02-0550-5",null,"ACS800-02-0490-7"]
[{"$f":"TypeListTemplate!A47","v":670.51092932814799},{"$f":"TypeListTemplate!B47","v":500},{"$f":"TypeListTemplate!C47","v":450.01},null,null,null,null,null,null,"ACS800-07-0610-3",null,"ACS800-02-0610-5",null,"ACS800-02-0610-5",null,"ACS800-02-0550-7"]
[{"$f":"TypeListTemplate!A48","v":750.97224084752577},{"$f":"TypeListTemplate!B48","v":560},{"$f":"TypeListTemplate!C48","v":500.01},null,null,null,null,null,null,"ACS800-07-0770-3",null,"ACS800-07-0760-5",null,"ACS800-07-0760-5",null,"ACS800-02-0610-7"]
[{"$f":"TypeListTemplate!A49","v":844.84377095346656},{"$f":"TypeListTemplate!B49","v":630},{"$f":"TypeListTemplate!C49","v":560.01},null,null,null,null,null,null,"ACS800-07-0770-3",null,"ACS800-07-0760-5",null,"ACS800-07-0760-5",null,"ACS800-07-0750-7"]
[{"$f":"TypeListTemplate!A50","v":952.12551964597014},{"$f":"TypeListTemplate!B50","v":710},{"$f":"TypeListTemplate!C50","v":630.01},null,null,null,null,null,null,"ACS800-07-0870-3",null,"ACS800-07-0910-5",null,"ACS800-07-0910-5",null,"ACS800-07-0870-7"]
[{"$f":"TypeListTemplate!A51","v":1072.8174869250367},{"$f":"TypeListTemplate!B51","v":800},{"$f":"TypeListTemplate!C51","v":710.01},null,null,null,null,null,null,"ACS800-07-1030-3",null,"ACS800-07-1090-5",null,"ACS800-07-1090-5",null,"ACS800-07-1060-7"]
[{"$f":"TypeListTemplate!A52","v":1206.9196727906665},{"$f":"TypeListTemplate!B52","v":900},{"$f":"TypeListTemplate!C52","v":800.01},null,null,null,null,null,null,"ACS800-07-1230-3",null,"ACS800-07-1090-5",null,"ACS800-07-1090-5",null,"ACS800-07-1160-7"]
[{"$f":"TypeListTemplate!A53","v":1341.021858656296},{"$f":"TypeListTemplate!B53","v":1000},{"$f":"TypeListTemplate!C53","v":900.01},null,null,null,null,null,null,"ACS800-07-1230-3",null,"ACS800-07-1210-5",null,"ACS800-07-1210-5",null,"ACS800-07-1500-7"]
[{"$f":"TypeListTemplate!A54","v":1501.9444816950515},{"$f":"TypeListTemplate!B54","v":1120},{"$f":"TypeListTemplate!C54","v":1000.01},null,null,null,null,null,null,"ACS800-07-1540-3",null,"ACS800-07-1540-5",null,"ACS800-07-1540-5",null,"ACS800-07-1500-7"]
[{"$f":"TypeListTemplate!A55","v":1676.27732332037},{"$f":"TypeListTemplate!B55","v":1250},{"$f":"TypeListTemplate!C55","v":1120.01},null,null,null,null,null,null,"ACS800-07-1850-3",null,"ACS800-07-1540-5",null,"ACS800-07-1540-5",null,"ACS800-07-1740-7"]
[{"$f":"TypeListTemplate!A56","v":1877.4306021188145},{"$f":"TypeListTemplate!B56","v":1400},{"$f":"TypeListTemplate!C56","v":1250.01},null,null,null,null,null,null,"ACS800-07-1850-3",null,"ACS800-07-1820-5",null,"ACS800-07-1820-5",null,"ACS800-07-1740-7"]
[{"$f":"TypeListTemplate!A57","v":2145.6349738500735},{"$f":"TypeListTemplate!B57","v":1600},{"$f":"TypeListTemplate!C57","v":1400.01},null,null,null,null,null,null,"Check with ABB!",null,"ACS800-07-2310-5",null,"ACS800-07-2310-5",null,"ACS800-07-2120-7"]
[{"$f":"TypeListTemplate!A58","v":2346.7882526485182},{"$f":"TypeListTemplate!B58","v":1750},{"$f":"TypeListTemplate!C58","v":1600.01},null,null,null,null,null,null,null,null,"ACS800-07-2310-5",null,"ACS800-07-2310-5",null,"ACS800-07-2320-7"]
[{"$f":"TypeListTemplate!A59","v":2413.839345581333},{"$f":"TypeListTemplate!B59","v":1800},{"$f":"TypeListTemplate!C59","v":1750.01},null,null,null,null,null,null,null,null,"ACS800-07-2310-5",null,"ACS800-07-2310-5",null,"ACS800-07-2320-7"]
[{"$f":"TypeListTemplate!A60","v":2682.043717312592},{"$f":"TypeListTemplate!B60","v":2000},{"$f":"TypeListTemplate!C60","v":1800.01},null,null,null,null,null,null,null,null,"Check with ABB!",null,"Check with ABB!",null,"ACS800-07-2900-7"]
[{"$f":"TypeListTemplate!A61","v":2950.2480890438515},{"$f":"TypeListTemplate!B61","v":2200},{"$f":"TypeListTemplate!C61","v":2000.01},null,null,null,null,null,null,null,null,null,null,null,null,"ACS800-07-2900-7"]
[{"$f":"TypeListTemplate!A62","v":3017.2991819766662},{"$f":"TypeListTemplate!B62","v":2250},{"$f":"TypeListTemplate!C62","v":2200.0100000000002},null,null,null,null,null,null,null,null,null,null,null,null,"ACS800-07-2900-7"]
[{"$f":"TypeListTemplate!A63","v":3084.350274909481},{"$f":"TypeListTemplate!B63","v":2300},{"$f":"TypeListTemplate!C63","v":2250.0100000000002},null,null,null,null,null,null,null,null,null,null,null,null,"ACS800-07-2900-7"]
[{"$f":"TypeListTemplate!A64","v":3352.55464664074},{"$f":"TypeListTemplate!B64","v":2500},{"$f":"TypeListTemplate!C64","v":2300.0100000000002},null,null,null,null,null,null,null,null,null,null,null,null,"ACS800-07-3190-7"]
[{"$f":"TypeListTemplate!A65","v":3754.861204237629},{"$f":"TypeListTemplate!B65","v":2800},{"$f":"TypeListTemplate!C65","v":2500.0100000000002},null,null,null,null,null,null,null,null,null,null,null,null,"ACS800-07-3490-7"]
[{"$f":"TypeListTemplate!A66","v":4224.2188547673322},{"$f":"TypeListTemplate!B66","v":3150},{"$f":"TypeListTemplate!C66","v":2800.01},null,null,null,null,null,null,null,null,null,null,null,null,"Check with ABB!"]
[{"$f":"TypeListTemplate!A67","v":4760.6275982298512},{"$f":"TypeListTemplate!B67","v":3550},{"$f":"TypeListTemplate!C67","v":3150.01}]
[{"$f":"TypeListTemplate!A68","v":5364.087434625184},{"$f":"TypeListTemplate!B68","v":4000},{"$f":"TypeListTemplate!C68","v":3550.01}]
[{"$f":"TypeListTemplate!A69","v":6034.5983639533324},{"$f":"TypeListTemplate!B69","v":4500},{"$f":"TypeListTemplate!C69","v":4000.01}]
[{"$f":"TypeListTemplate!A70","v":6705.1092932814799},{"$f":"TypeListTemplate!B70","v":5000},{"$f":"TypeListTemplate!C70","v":4500.01}]
[{"$f":"TypeListTemplate!A71","v":0},{"$f":"TypeListTemplate!B71","v":999999999},{"$f":"TypeListTemplate!C71","v":5000.01}]
[{"$f":"TypeListTemplate!A72","v":0},{"$f":"TypeListTemplate!B72","v":0},{"$f":"TypeListTemplate!C72","v":0}]
[{"$f":"TypeListTemplate!A73","v":0},{"$f":"TypeListTemplate!B73","v":0},{"$f":"TypeListTemplate!C73","v":0},{"$f":"TypeListTemplate!D73","v":"Drive type"},{"$f":"TypeListTemplate!E73","v":0},{"$f":"TypeListTemplate!F73","v":"Drive type"},{"$f":"TypeListTemplate!G73","v":0},{"$f":"TypeListTemplate!H73","v":"Drive type"},{"$f":"TypeListTemplate!I73","v":0},{"$f":"TypeListTemplate!J73","v":"Drive type"},{"$f":"TypeListTemplate!K73","v":0},{"$f":"TypeListTemplate!L73","v":"Drive type"},{"$f":"TypeListTemplate!M73","v":0},{"$f":"TypeListTemplate!N73","v":"Drive type"},{"$f":"TypeListTemplate!O73","v":0},{"$f":"TypeListTemplate!P73","v":"Drive type"},{"$f":"TypeListTemplate!Q73","v":0}]
[{"$f":"TypeListTemplate!A74","v":0},{"$f":"TypeListTemplate!B74","v":0},{"$f":"TypeListTemplate!C74","v":0},{"$f":"TypeListTemplate!D74","v":" 115 V (1-ph)"},{"$f":"TypeListTemplate!E74","v":0},{"$f":"TypeListTemplate!F74","v":" 230 V (1-ph)"},{"$f":"TypeListTemplate!G74","v":0},{"$f":"TypeListTemplate!H74","v":" 230 V (3-ph)"},{"$f":"TypeListTemplate!I74","v":0},{"$f":"TypeListTemplate!J74","v":" 400 V"},{"$f":"TypeListTemplate!K74","v":0},{"$f":"TypeListTemplate!L74","v":" 460 V"},{"$f":"TypeListTemplate!M74","v":0},{"$f":"TypeListTemplate!N74","v":" 500 V"},{"$f":"TypeListTemplate!O74","v":0},{"$f":"TypeListTemplate!P74","v":" 690 V"},{"$f":"TypeListTemplate!Q74","v":0}]
[{"$f":"TypeListTemplate!A75","v":0},{"$f":"TypeListTemplate!B75","v":0},{"$f":"TypeListTemplate!C75","v":0},{"$f":"TypeListTemplate!D75","v":0},{"$f":"TypeListTemplate!E75","v":0},{"$f":"TypeListTemplate!F75","v":0},{"$f":"TypeListTemplate!G75","v":0},{"$f":"TypeListTemplate!H75","v":0},{"$f":"TypeListTemplate!I75","v":0},{"$f":"TypeListTemplate!J75","v":0},{"$f":"TypeListTemplate!K75","v":0},{"$f":"TypeListTemplate!L75","v":0},{"$f":"TypeListTemplate!M75","v":0},{"$f":"TypeListTemplate!N75","v":0},{"$f":"TypeListTemplate!O75","v":0},{"$f":"TypeListTemplate!P75","v":0},{"$f":"TypeListTemplate!Q75","v":0}]
[{"$f":"TypeListTemplate!A76","v":0},{"$f":"TypeListTemplate!B76","v":0},{"$f":"TypeListTemplate!C76","v":0},{"$f":"TypeListTemplate!D76","v":0},{"$f":"TypeListTemplate!E76","v":0},{"$f":"TypeListTemplate!F76","v":0},{"$f":"TypeListTemplate!G76","v":0},{"$f":"TypeListTemplate!H76","v":0},{"$f":"TypeListTemplate!I76","v":0},{"$f":"TypeListTemplate!J76","v":0},{"$f":"TypeListTemplate!K76","v":0},{"$f":"TypeListTemplate!L76","v":0},{"$f":"TypeListTemplate!M76","v":0},{"$f":"TypeListTemplate!N76","v":0},{"$f":"TypeListTemplate!O76","v":0},{"$f":"TypeListTemplate!P76","v":0},{"$f":"TypeListTemplate!Q76","v":0}]
[{"$f":"TypeListTemplate!A77","v":0},{"$f":"TypeListTemplate!B77","v":0},{"$f":"TypeListTemplate!C77","v":0},{"$f":"TypeListTemplate!D77","v":0},{"$f":"TypeListTemplate!E77","v":0},{"$f":"TypeListTemplate!F77","v":0},{"$f":"TypeListTemplate!G77","v":0},{"$f":"TypeListTemplate!H77","v":0},{"$f":"TypeListTemplate!I77","v":0},{"$f":"TypeListTemplate!J77","v":0},{"$f":"TypeListTemplate!K77","v":0},{"$f":"TypeListTemplate!L77","v":0},{"$f":"TypeListTemplate!M77","v":0},{"$f":"TypeListTemplate!N77","v":0},{"$f":"TypeListTemplate!O77","v":0},{"$f":"TypeListTemplate!P77","v":0},{"$f":"TypeListTemplate!Q77","v":0}]
[{"$f":"TypeListTemplate!A78","v":0},{"$f":"TypeListTemplate!B78","v":0},{"$f":"TypeListTemplate!C78","v":0},{"$f":"TypeListTemplate!D78","v":0},{"$f":"TypeListTemplate!E78","v":0},{"$f":"TypeListTemplate!F78","v":0},{"$f":"TypeListTemplate!G78","v":0},{"$f":"TypeListTemplate!H78","v":0},{"$f":"TypeListTemplate!I78","v":0},{"$f":"TypeListTemplate!J78","v":0},{"$f":"TypeListTemplate!K78","v":0},{"$f":"TypeListTemplate!L78","v":0},{"$f":"TypeListTemplate!M78","v":0},{"$f":"TypeListTemplate!N78","v":0},{"$f":"TypeListTemplate!O78","v":0},{"$f":"TypeListTemplate!P78","v":0},{"$f":"TypeListTemplate!Q78","v":0}]
[{"$f":"TypeListTemplate!A79","v":0},{"$f":"TypeListTemplate!B79","v":0},{"$f":"TypeListTemplate!C79","v":0},{"$f":"TypeListTemplate!D79","v":0},{"$f":"TypeListTemplate!E79","v":0},{"$f":"TypeListTemplate!F79","v":0},{"$f":"TypeListTemplate!G79","v":0},{"$f":"TypeListTemplate!H79","v":0},{"$f":"TypeListTemplate!I79","v":0},{"$f":"TypeListTemplate!J79","v":0},{"$f":"TypeListTemplate!K79","v":0},{"$f":"TypeListTemplate!L79","v":0},{"$f":"TypeListTemplate!M79","v":0},{"$f":"TypeListTemplate!N79","v":0},{"$f":"TypeListTemplate!O79","v":0},{"$f":"TypeListTemplate!P79","v":0},{"$f":"TypeListTemplate!Q79","v":0}]
[{"$f":"TypeListTemplate!A80","v":0},{"$f":"TypeListTemplate!B80","v":0},{"$f":"TypeListTemplate!C80","v":0},{"$f":"TypeListTemplate!D80","v":0},{"$f":"TypeListTemplate!E80","v":0},{"$f":"TypeListTemplate!F80","v":0},{"$f":"TypeListTemplate!G80","v":0},{"$f":"TypeListTemplate!H80","v":0},{"$f":"TypeListTemplate!I80","v":0},{"$f":"TypeListTemplate!J80","v":0},{"$f":"TypeListTemplate!K80","v":0},{"$f":"TypeListTemplate!L80","v":0},{"$f":"TypeListTemplate!M80","v":0},{"$f":"TypeListTemplate!N80","v":0},{"$f":"TypeListTemplate!O80","v":0},{"$f":"TypeListTemplate!P80","v":0},{"$f":"TypeListTemplate!Q80","v":0}]
[{"$f":"TypeListTemplate!A81","v":0},{"$f":"TypeListTemplate!B81","v":0},{"$f":"TypeListTemplate!C81","v":0},{"$f":"TypeListTemplate!D81","v":0},{"$f":"TypeListTemplate!E81","v":0},{"$f":"TypeListTemplate!F81","v":0},{"$f":"TypeListTemplate!G81","v":0},{"$f":"TypeListTemplate!H81","v":0},{"$f":"TypeListTemplate!I81","v":0},{"$f":"TypeListTemplate!J81","v":0},{"$f":"TypeListTemplate!K81","v":0},{"$f":"TypeListTemplate!L81","v":0},{"$f":"TypeListTemplate!M81","v":0},{"$f":"TypeListTemplate!N81","v":0},{"$f":"TypeListTemplate!O81","v":0},{"$f":"TypeListTemplate!P81","v":0},{"$f":"TypeListTemplate!Q81","v":0}]
[{"$f":"TypeListTemplate!A82","v":0},{"$f":"TypeListTemplate!B82","v":0},{"$f":"TypeListTemplate!C82","v":0},{"$f":"TypeListTemplate!D82","v":0},{"$f":"TypeListTemplate!E82","v":0},{"$f":"TypeListTemplate!F82","v":0},{"$f":"TypeListTemplate!G82","v":0},{"$f":"TypeListTemplate!H82","v":0},{"$f":"TypeListTemplate!I82","v":0},{"$f":"TypeListTemplate!J82","v":0},{"$f":"TypeListTemplate!K82","v":0},{"$f":"TypeListTemplate!L82","v":0},{"$f":"TypeListTemplate!M82","v":0},{"$f":"TypeListTemplate!N82","v":0},{"$f":"TypeListTemplate!O82","v":0},{"$f":"TypeListTemplate!P82","v":0},{"$f":"TypeListTemplate!Q82","v":0}]
[{"$f":"TypeListTemplate!A83","v":0},{"$f":"TypeListTemplate!B83","v":0},{"$f":"TypeListTemplate!C83","v":0},{"$f":"TypeListTemplate!D83","v":0},{"$f":"TypeListTemplate!E83","v":0},{"$f":"TypeListTemplate!F83","v":0},{"$f":"TypeListTemplate!G83","v":0},{"$f":"TypeListTemplate!H83","v":0},{"$f":"TypeListTemplate!I83","v":0},{"$f":"TypeListTemplate!J83","v":0},{"$f":"TypeListTemplate!K83","v":0},{"$f":"TypeListTemplate!L83","v":0},{"$f":"TypeListTemplate!M83","v":0},{"$f":"TypeListTemplate!N83","v":0},{"$f":"TypeListTemplate!O83","v":0},{"$f":"TypeListTemplate!P83","v":0},{"$f":"TypeListTemplate!Q83","v":0}]
[{"$f":"TypeListTemplate!A84","v":0},{"$f":"TypeListTemplate!B84","v":0},{"$f":"TypeListTemplate!C84","v":0},{"$f":"TypeListTemplate!D84","v":0},{"$f":"TypeListTemplate!E84","v":0},{"$f":"TypeListTemplate!F84","v":0},{"$f":"TypeListTemplate!G84","v":0},{"$f":"TypeListTemplate!H84","v":0},{"$f":"TypeListTemplate!I84","v":0},{"$f":"TypeListTemplate!J84","v":0},{"$f":"TypeListTemplate!K84","v":0},{"$f":"TypeListTemplate!L84","v":0},{"$f":"TypeListTemplate!M84","v":0},{"$f":"TypeListTemplate!N84","v":0},{"$f":"TypeListTemplate!O84","v":0},{"$f":"TypeListTemplate!P84","v":0},{"$f":"TypeListTemplate!Q84","v":0}]
[{"$f":"TypeListTemplate!A85","v":0},{"$f":"TypeListTemplate!B85","v":0},{"$f":"TypeListTemplate!C85","v":0},{"$f":"TypeListTemplate!D85","v":0},{"$f":"TypeListTemplate!E85","v":0},{"$f":"TypeListTemplate!F85","v":0},{"$f":"TypeListTemplate!G85","v":0},{"$f":"TypeListTemplate!H85","v":0},{"$f":"TypeListTemplate!I85","v":0},{"$f":"TypeListTemplate!J85","v":0},{"$f":"TypeListTemplate!K85","v":0},{"$f":"TypeListTemplate!L85","v":0},{"$f":"TypeListTemplate!M85","v":0},{"$f":"TypeListTemplate!N85","v":0},{"$f":"TypeListTemplate!O85","v":0},{"$f":"TypeListTemplate!P85","v":0},{"$f":"TypeListTemplate!Q85","v":0}]
[{"$f":"TypeListTemplate!A86","v":0},{"$f":"TypeListTemplate!B86","v":0},{"$f":"TypeListTemplate!C86","v":0},{"$f":"TypeListTemplate!D86","v":0},{"$f":"TypeListTemplate!E86","v":0},{"$f":"TypeListTemplate!F86","v":0},{"$f":"TypeListTemplate!G86","v":0},{"$f":"TypeListTemplate!H86","v":0},{"$f":"TypeListTemplate!I86","v":0},{"$f":"TypeListTemplate!J86","v":0},{"$f":"TypeListTemplate!K86","v":0},{"$f":"TypeListTemplate!L86","v":0},{"$f":"TypeListTemplate!M86","v":0},{"$f":"TypeListTemplate!N86","v":0},{"$f":"TypeListTemplate!O86","v":0},{"$f":"TypeListTemplate!P86","v":0},{"$f":"TypeListTemplate!Q86","v":0}]
[{"$f":"TypeListTemplate!A87","v":0},{"$f":"TypeListTemplate!B87","v":0},{"$f":"TypeListTemplate!C87","v":0},{"$f":"TypeListTemplate!D87","v":0},{"$f":"TypeListTemplate!E87","v":0},{"$f":"TypeListTemplate!F87","v":0},{"$f":"TypeListTemplate!G87","v":0},{"$f":"TypeListTemplate!H87","v":0},{"$f":"TypeListTemplate!I87","v":0},{"$f":"TypeListTemplate!J87","v":0},{"$f":"TypeListTemplate!K87","v":0},{"$f":"TypeListTemplate!L87","v":0},{"$f":"TypeListTemplate!M87","v":0},{"$f":"TypeListTemplate!N87","v":0},{"$f":"TypeListTemplate!O87","v":0},{"$f":"TypeListTemplate!P87","v":0},{"$f":"TypeListTemplate!Q87","v":0}]
[{"$f":"TypeListTemplate!A88","v":0},{"$f":"TypeListTemplate!B88","v":0},{"$f":"TypeListTemplate!C88","v":0},{"$f":"TypeListTemplate!D88","v":0},{"$f":"TypeListTemplate!E88","v":0},{"$f":"TypeListTemplate!F88","v":0},{"$f":"TypeListTemplate!G88","v":0},{"$f":"TypeListTemplate!H88","v":0},{"$f":"TypeListTemplate!I88","v":0},{"$f":"TypeListTemplate!J88","v":0},{"$f":"TypeListTemplate!K88","v":0},{"$f":"TypeListTemplate!L88","v":0},{"$f":"TypeListTemplate!M88","v":0},{"$f":"TypeListTemplate!N88","v":0},{"$f":"TypeListTemplate!O88","v":0},{"$f":"TypeListTemplate!P88","v":0},{"$f":"TypeListTemplate!Q88","v":0}]
[{"$f":"TypeListTemplate!A89","v":0},{"$f":"TypeListTemplate!B89","v":0},{"$f":"TypeListTemplate!C89","v":0},{"$f":"TypeListTemplate!D89","v":0},{"$f":"TypeListTemplate!E89","v":0},{"$f":"TypeListTemplate!F89","v":0},{"$f":"TypeListTemplate!G89","v":0},{"$f":"TypeListTemplate!H89","v":0},{"$f":"TypeListTemplate!I89","v":0},{"$f":"TypeListTemplate!J89","v":0},{"$f":"TypeListTemplate!K89","v":0},{"$f":"TypeListTemplate!L89","v":0},{"$f":"TypeListTemplate!M89","v":0},{"$f":"TypeListTemplate!N89","v":0},{"$f":"TypeListTemplate!O89","v":0},{"$f":"TypeListTemplate!P89","v":0},{"$f":"TypeListTemplate!Q89","v":0}]
[{"$f":"TypeListTemplate!A90","v":0},{"$f":"TypeListTemplate!B90","v":0},{"$f":"TypeListTemplate!C90","v":0},{"$f":"TypeListTemplate!D90","v":0},{"$f":"TypeListTemplate!E90","v":0},{"$f":"TypeListTemplate!F90","v":0},{"$f":"TypeListTemplate!G90","v":0},{"$f":"TypeListTemplate!H90","v":0},{"$f":"TypeListTemplate!I90","v":0},{"$f":"TypeListTemplate!J90","v":0},{"$f":"TypeListTemplate!K90","v":0},{"$f":"TypeListTemplate!L90","v":0},{"$f":"TypeListTemplate!M90","v":0},{"$f":"TypeListTemplate!N90","v":0},{"$f":"TypeListTemplate!O90","v":0},{"$f":"TypeListTemplate!P90","v":0},{"$f":"TypeListTemplate!Q90","v":0}]
[{"$f":"TypeListTemplate!A91","v":0},{"$f":"TypeListTemplate!B91","v":0},{"$f":"TypeListTemplate!C91","v":0},{"$f":"TypeListTemplate!D91","v":0},{"$f":"TypeListTemplate!E91","v":0},{"$f":"TypeListTemplate!F91","v":0},{"$f":"TypeListTemplate!G91","v":0},{"$f":"TypeListTemplate!H91","v":0},{"$f":"TypeListTemplate!I91","v":0},{"$f":"TypeListTemplate!J91","v":0},{"$f":"TypeListTemplate!K91","v":0},{"$f":"TypeListTemplate!L91","v":0},{"$f":"TypeListTemplate!M91","v":0},{"$f":"TypeListTemplate!N91","v":0},{"$f":"TypeListTemplate!O91","v":0},{"$f":"TypeListTemplate!P91","v":0},{"$f":"TypeListTemplate!Q91","v":0}]
[{"$f":"TypeListTemplate!A92","v":0},{"$f":"TypeListTemplate!B92","v":0},{"$f":"TypeListTemplate!C92","v":0},{"$f":"TypeListTemplate!D92","v":0},{"$f":"TypeListTemplate!E92","v":0},{"$f":"TypeListTemplate!F92","v":0},{"$f":"TypeListTemplate!G92","v":0},{"$f":"TypeListTemplate!H92","v":0},{"$f":"TypeListTemplate!I92","v":0},{"$f":"TypeListTemplate!J92","v":0},{"$f":"TypeListTemplate!K92","v":0},{"$f":"TypeListTemplate!L92","v":0},{"$f":"TypeListTemplate!M92","v":0},{"$f":"TypeListTemplate!N92","v":0},{"$f":"TypeListTemplate!O92","v":0},{"$f":"TypeListTemplate!P92","v":0},{"$f":"TypeListTemplate!Q92","v":0}]
[{"$f":"TypeListTemplate!A93","v":0},{"$f":"TypeListTemplate!B93","v":0},{"$f":"TypeListTemplate!C93","v":0},{"$f":"TypeListTemplate!D93","v":0},{"$f":"TypeListTemplate!E93","v":0},{"$f":"TypeListTemplate!F93","v":0},{"$f":"TypeListTemplate!G93","v":0},{"$f":"TypeListTemplate!H93","v":0},{"$f":"TypeListTemplate!I93","v":0},{"$f":"TypeListTemplate!J93","v":0},{"$f":"TypeListTemplate!K93","v":0},{"$f":"TypeListTemplate!L93","v":0},{"$f":"TypeListTemplate!M93","v":0},{"$f":"TypeListTemplate!N93","v":0},{"$f":"TypeListTemplate!O93","v":0},{"$f":"TypeListTemplate!P93","v":0},{"$f":"TypeListTemplate!Q93","v":0}]
[{"$f":"TypeListTemplate!A94","v":0},{"$f":"TypeListTemplate!B94","v":0},{"$f":"TypeListTemplate!C94","v":0},{"$f":"TypeListTemplate!D94","v":0},{"$f":"TypeListTemplate!E94","v":0},{"$f":"TypeListTemplate!F94","v":0},{"$f":"TypeListTemplate!G94","v":0},{"$f":"TypeListTemplate!H94","v":0},{"$f":"TypeListTemplate!I94","v":0},{"$f":"TypeListTemplate!J94","v":0},{"$f":"TypeListTemplate!K94","v":0},{"$f":"TypeListTemplate!L94","v":0},{"$f":"TypeListTemplate!M94","v":0},{"$f":"TypeListTemplate!N94","v":0},{"$f":"TypeListTemplate!O94","v":0},{"$f":"TypeListTemplate!P94","v":0},{"$f":"TypeListTemplate!Q94","v":0}]
[{"$f":"TypeListTemplate!A95","v":0},{"$f":"TypeListTemplate!B95","v":0},{"$f":"TypeListTemplate!C95","v":0},{"$f":"TypeListTemplate!D95","v":0},{"$f":"TypeListTemplate!E95","v":0},{"$f":"TypeListTemplate!F95","v":0},{"$f":"TypeListTemplate!G95","v":0},{"$f":"TypeListTemplate!H95","v":0},{"$f":"TypeListTemplate!I95","v":0},{"$f":"TypeListTemplate!J95","v":0},{"$f":"TypeListTemplate!K95","v":0},{"$f":"TypeListTemplate!L95","v":0},{"$f":"TypeListTemplate!M95","v":0},{"$f":"TypeListTemplate!N95","v":0},{"$f":"TypeListTemplate!O95","v":0},{"$f":"TypeListTemplate!P95","v":0},{"$f":"TypeListTemplate!Q95","v":0}]

{"sheet":"ACS880","index":11,"n_rows":113,"n_cols":17,"rows_kept":113,"cut":false,"hidden":true,"merged":[]}
["Typecode","Prod.class",null,"Voltage range 1",null,"Voltage range 2 (1-ph)",null,"Voltage range 2",null,"Voltage range 3",null,"Voltage range 4.6",null,"Voltage range 5",null,"Voltage range 7/6"]
[{"$f":"VLOOKUP(DriveSel!E20,C8:Y71,DriveSel!D18)","v":"ACS880-01-246A-3"},{"$f":"VLOOKUP(#REF!,C8:X70,7)","v":{"$error":"#REF!"}},"non-US (50Hz)"," 115 V (1-ph)",null," 230 V (1-ph)",null," 230 V (3-ph)",null," 400 V",null," 460 V",null," 500 V",null," 690 V"]
["Col.ordinal","Col.ordinal","US (60Hz)"," 115 V (1-ph)",null," 230 V (1-ph)",null," 230 V (3-ph)",null," 400 V",null," 460 V",null," 500 V",null," 575 V"]
[null,null,"Alternatives:","115 V 1-ph",null,"200/208/230/240 V 1-ph",null,"200/208/230/240 V 3-ph",null,"380/400/415 V",null,"440/460/480 V",null,"500 V",null,"525/550/575/600/660/690 V"]
["Motor Power","Motor",null,"Drive type",null,"Drive type",null,"Drive type",null,"Drive type",null,"Drive type",null,"Drive type",null,"Drive type"]
["Hp","power kW"]
[0,"Column Ordinal ->",1,2,3,4,5,6,7,8,9,10,11,12,13,14,15]
[0,0,0]
[7.3756202226096287E-2,5.5E-2,0.01]
[0.12069196727906664,0.09,6.5000000000000002E-2]
[0.16092262303875551,0.12,9.9999999999999992E-2]
[0.24138393455813328,0.18,0.13]
[0.49617808770282951,0.37,0.19]
[0.7375620222609629,0.55000000000000004,0.38]
[1.0057663939922221,0.75,0.56000000000000005,null,null,null,null,"ACS880-01-04A6-2","wall-mounted","ACS880-01-02A4-3",null,"ACS880-01-02A1-5",null,"ACS880-01-02A1-5"]
[1.4751240445219258,1.1000000000000001,0.76,null,null,null,null,"ACS880-01-06A6-2","wall-mounted","ACS880-01-03A3-3",null,"ACS880-01-03A0-5",null,"ACS880-01-03A0-5"]
[2.0115327879844442,1.5,1.1100000000000001,null,null,null,null,"ACS880-01-07A5-2","wall-mounted","ACS880-01-04A0-3",null,"ACS880-01-03A4-5",null,"ACS880-01-03A4-5"]
[2.9502480890438516,2.2000000000000002,1.51,null,null,null,null,"ACS880-01-10A6-2","wall-mounted","ACS880-01-05A6-3",null,"ACS880-01-04A8-5",null,"ACS880-01-04A8-5"]
[4.0230655759688885,3,2.21,null,null,null,null,"ACS880-01-16A8-2","wall-mounted","ACS880-01-07A2-3",null,"ACS880-01-05A2-5",null,"ACS880-01-05A2-5"]
[5,3.7285000000000004,3.01,null,null,null,null,"ACS880-01-16A8-2",null,"ACS880-01-09A4-3",null,"ACS880-01-07A6-5",null,"ACS880-01-07A6-5"]
[5.3640874346251843,4,3.7385000000000002,null,null,null,null,"ACS880-01-16A8-2","wall-mounted","ACS880-01-09A4-3",null,"ACS880-01-07A6-5",null,"ACS880-01-07A6-5"]
[7.3756202226096281,5.5,4.01,null,null,null,null,"ACS880-01-24A3-2","wall-mounted","ACS880-01-12A6-3",null,"ACS880-01-11A0-5",null,"ACS880-01-11A0-5",null,"ACS880-01-07A3-7"]
[10.05766393992222,7.5,5.51,null,null,null,null,"ACS880-01-031A-2","wall-mounted","ACS880-01-17A0-3",null,"ACS880-01-014A-5",null,"ACS880-01-014A-5",null,"ACS880-01-09A8-7"]
[14.751240445219256,11,7.51,null,null,null,null,"ACS880-01-046A-2","wall-mounted","ACS880-01-25A0-3",null,"ACS880-01-021A-5",null,"ACS880-01-021A-5",null,"ACS880-01-14A2-7"]
[20.11532787984444,15,11.01,null,null,null,null,"ACS880-01-061A-2","wall-mounted","ACS880-01-32A0-3",null,"ACS880-01-027A-5",null,"ACS880-01-027A-5",null,"ACS880-01-018A-7"]
[24.808904385141478,18.5,15.01,null,null,null,null,"ACS880-01-075A-2","wall-mounted","ACS880-01-38A0-3",null,"ACS880-01-034A-5",null,"ACS880-01-034A-5",null,"ACS880-01-022A-7"]
[29.502480890438513,22,18.510000000000002,null,null,null,null,"ACS880-01-087A-2","wall-mounted","ACS880-01-45A0-3",null,"ACS880-01-040A-5",null,"ACS880-01-040A-5",null,"ACS880-01-026A-7"]
[40.230655759688879,30,22.01,null,null,null,null,"ACS880-01-115A-2","wall-mounted","ACS880-01-61A0-3",null,"ACS880-01-52A0-5",null,"ACS880-01-52A0-5",null,"ACS880-01-035A-7"]
[49.617808770282956,37,30.01,null,null,null,null,"ACS880-01-145A-2","wall-mounted","ACS880-01-72A0-3",null,"ACS880-01-65A0-5",null,"ACS880-01-65A0-5",null,"ACS880-01-042A-7"]
[60.345983639533323,45,37.01,null,null,null,null,"ACS880-01-170A-2","wall-mounted","ACS880-01-87A0-3",null,"ACS880-01-77A0-5",null,"ACS880-01-77A0-5",null,"ACS880-01-049A-7"]
[73.756202226096278,55,45.01,null,null,null,null,"ACS880-01-206A-2","wall-mounted","ACS880-01-105A-3",null,"ACS880-01-096A-5",null,"ACS880-01-096A-5",null,"ACS880-01-061A-7"]
[100.5766393992222,75,55.01,null,null,null,null,"ACS880-01-274A-2","wall-mounted","ACS880-01-145A-3",null,"ACS880-01-124A-5",null,"ACS880-01-124A-5",null,"ACS880-01-084A-7"]
[120.69196727906665,90,75.010000000000005,null,null,null,null,"Check with ABB!","wall-mounted","ACS880-01-169A-3",null,"ACS880-01-156A-5",null,"ACS880-01-156A-5",null,"ACS880-01-098A-7"]
[147.51240445219256,110,90.01,null,null,null,null,null,"wall-mounted","ACS880-01-206A-3",null,"ACS880-01-180A-5",null,"ACS880-01-180A-5",null,"ACS880-01-119A-7"]
[177.01488534263109,132,110.01,null,null,null,null,null,"wall-mounted","ACS880-01-246A-3",null,"ACS880-01-240A-5",null,"ACS880-01-240A-5",null,"ACS880-01-142A-7"]
[200,149.14000000000001,132.01,null,null,null,null,null,null,"ACS880-01-293A-3",null,"ACS880-01-260A-5",null,"ACS880-01-260A-5",null,"ACS880-01-174A-7"]
[214.56349738500737,160,149.15,null,null,null,null,null,"wall-mounted","ACS880-01-293A-3",null,"ACS880-01-260A-5",null,"ACS880-01-260A-5",null,"ACS880-01-174A-7"]
[250,186.42500000000001,160.01,null,null,null,null,null,null,"ACS880-01-363A-3",null,"ACS880-01-361A-5",null,"ACS880-01-361A-5",null,"ACS880-01-210A-7"]
[268.20437173125919,200,186.435,null,null,null,null,null,"wall-mounted","ACS880-01-363A-3",null,"ACS880-01-361A-5",null,"ACS880-01-361A-5",null,"ACS880-01-210A-7"]
[300,223.71,200.01,null,null,null,null,null,null,"ACS880-01-430A-3",null,"ACS880-01-414A-5",null,"ACS880-01-414A-5",null,"ACS880-01-271A-7"]
[335.255464664074,250,223.72,null,null,null,null,null,"wall-mounted","ACS880-01-430A-3",null,"ACS880-01-414A-5",null,"ACS880-01-414A-5",null,"ACS880-01-271A-7"]
[400,298.28000000000003,250.01,null,null,null,null,null,null,"ACS880-07-0585A-3",null,"ACS880-07-0460A-5",null,"ACS880-07-0460A-5",null,"ACS880-07-0800A-7"]
[422.42188547673328,315,298.29000000000002,null,null,null,null,null,null,"ACS880-07-0585A-3",null,"ACS880-07-0460A-5",null,"ACS880-07-0460A-5",null,"ACS880-07-0800A-7"]
[476.06275982298507,355,315.01,null,null,null,null,null,null,"ACS880-07-0650A-3",null,"ACS880-07-0503A-5",null,"ACS880-07-0503A-5",null,"ACS880-07-0800A-7"]
[536.40874346251837,400,355.01,null,null,null,null,null,null,"ACS880-07-0725A-3",null,"ACS880-07-0583A-5",null,"ACS880-07-0583A-5",null,"ACS880-07-0800A-7"]
[603.45983639533324,450,400.01,null,null,null,null,null,null,"ACS880-07-0820A-3",null,"ACS880-07-0635A-5",null,"ACS880-07-0635A-5",null,"ACS880-07-0800A-7"]
[670.51092932814799,500,450.01,null,null,null,null,null,null,"ACS880-07-0880A-3",null,"ACS880-07-0715A-5",null,"ACS880-07-0715A-5",null,"ACS880-07-0800A-7"]
[750.97224084752577,560,500.01,null,null,null,null,null,null,"ACS880-07-1140A-3",null,"ACS880-07-0820A-5",null,"ACS880-07-0820A-5",null,"ACS880-07-0800A-7"]
[844.84377095346656,630,560.01,null,null,null,null,null,null,"ACS880-07-1140A-3",null,"ACS880-07-1070A-5",null,"ACS880-07-1070A-5",null,"ACS880-07-0800A-7"]
[952.12551964597014,710,630.01,null,null,null,null,null,null,"ACS880-07-1480A-3",null,"ACS880-07-1070A-5",null,"ACS880-07-1070A-5",null,"ACS880-07-0800A-7"]
[1072.8174869250367,800,710.01,null,null,null,null,null,null,"ACS880-07-1480A-3",null,"ACS880-07-1320A-5",null,"ACS880-07-1320A-5",null,"ACS880-07-0800A-7"]
[1206.9196727906665,900,800.01,null,null,null,null,null,null,"ACS880-07-1760A-3",null,"ACS880-07-1320A-5",null,"ACS880-07-1320A-5",null,"ACS880-07-1160A-7"]
[1341.021858656296,1000,900.01,null,null,null,null,null,null,"ACS880-07-1760A-3",null,"ACS880-07-1580A-5",null,"ACS880-07-1580A-5",null,"ACS880-07-1160A-7"]
[1501.9444816950515,1120,1000.01,null,null,null,null,null,null,"ACS880-07-2610A-3",null,"ACS880-07-1980A-5",null,"ACS880-07-1980A-5",null,"ACS880-07-1650A-7"]
[1676.27732332037,1250,1120.01,null,null,null,null,null,null,"ACS880-07-2610A-3",null,"ACS880-07-1980A-5",null,"ACS880-07-1980A-5",null,"ACS880-07-1650A-7"]
[1877.4306021188145,1400,1250.01,null,null,null,null,null,null,"ACS880-07-2610A-3",null,"ACS880-07-1980A-5",null,"ACS880-07-1980A-5",null,"ACS880-07-1650A-7"]
[2145.6349738500735,1600,1400.01,null,null,null,null,null,null,"Check with ABB!",null,"Check with ABB!",null,"Check with ABB!",null,"ACS880-07-1650A-7"]
[2346.7882526485182,1750,1600.01,null,null,null,null,null,null,null,null,null,null,null,null,"ACS880-07-2300A-7"]
[2413.839345581333,1800,1750.01,null,null,null,null,null,null,null,null,null,null,null,null,"ACS880-07-2300A-7"]
[2682.043717312592,2000,1800.01,null,null,null,null,null,null,null,null,null,null,null,null,"ACS880-07-2300A-7"]
[2950.2480890438515,2200,2000.01,null,null,null,null,null,null,null,null,null,null,null,null,"ACS880-07-2300A-7"]
[3017.2991819766662,2250,2200.0100000000002,null,null,null,null,null,null,null,null,null,null,null,null,"ACS880-07-2860A-7"]
[3084.350274909481,2300,2250.0100000000002,null,null,null,null,null,null,null,null,null,null,null,null,"ACS880-07-2860A-7"]
[3352.55464664074,2500,2300.0100000000002,null,null,null,null,null,null,null,null,null,null,null,null,"ACS880-07-2860A-7"]
[3754.861204237629,2800,2500.0100000000002,null,null,null,null,null,null,null,null,null,null,null,null,"ACS880-07-2860A-7"]
[4224.2188547673322,3150,2800.01,null,null,null,null,null,null,null,null,null,null,null,null,"Check with ABB!"]
[4760.6275982298512,3550,3150.01]
[5364.087434625184,4000,3550.01]
[6034.5983639533324,4500,4000.01]
[6705.1092932814799,5000,4500.01]
[0,999999999,5000.01]
[0,0,0]
[0,0,0,"Drive type",0,"Drive type",0,"Drive type",0,"Drive type",0,"Drive type",0,"Drive type",0,"Drive type",0]
[0,0,0," 115 V (1-ph)",0," 230 V (1-ph)",0," 230 V (3-ph)",0," 400 V",0," 460 V",0," 500 V",0," 690 V",0]
[0,0,0,0,0,0,0,0,0,0,0,0,0,0,0,0,0]
[]
[]
[]
[]
[]
[]
[]
[]
[]
[]
[]
[]
[]
[]
[]
[]
[]
[]
[]
[]
[]
[]
[]
[]
[]
[]
[]
[]
[]
[]
[]
[]
[]
[null,null,null,null,null,null,null,null,null,null,null,null,"ACS880-01-02A1-5"]
[null,null,null,null,null,null,null,null,null,null,null,null,"ACS880-01-03A0-5"]
[null,null,null,null,null,null,null,null,null,null,null,null,"ACS880-01-03A4-5"]
[null,null,null,null,null,null,null,null,null,null,null,null,"ACS880-01-04A8-5"]
[null,null,null,null,null,null,null,null,null,null,null,null,"ACS880-01-05A2-5"]

{"sheet":"ACQ810","index":12,"n_rows":95,"n_cols":17,"rows_kept":95,"cut":false,"hidden":true,"merged":[]}
["Typecode","Prod.class",null,"Voltage range 1",null,"Voltage range 2 (1-ph)",null,"Voltage range 2",null,"Voltage range 3",null,"Voltage range 4.6",null,"Voltage range 5",null,"Voltage range 7/6"]
[{"$f":"VLOOKUP(DriveSel!E20,C8:Y71,DriveSel!D18)","v":"ACQ810-04-240A-4"},{"$f":"VLOOKUP(#REF!,C8:X70,7)","v":{"$error":"#REF!"}},"non-US (50Hz)"," 115 V (1-ph)",null," 230 V (1-ph)",null," 230 V (3-ph)",null," 400 V",null," 460 V",null," 500 V",null," 690 V"]
["Col.ordinal","Col.ordinal"]
[null,null,"Alternatives:","115 V 1-ph",null,"200/208/230/240 V 1-ph",null,"200/208/230/240 V 3-ph",null,"380/400/415 V",null,"440/460/480 V",null,"500 V",null,"525/550/575/600/660/690 V"]
[{"$f":"TypeListTemplate!A5","v":"Motor Power"},{"$f":"TypeListTemplate!B5","v":"Motor"},{"$f":"TypeListTemplate!C5","v":0},{"$f":"TypeListTemplate!D5","v":"Drive type"},{"$f":"TypeListTemplate!E5","v":0},{"$f":"TypeListTemplate!F5","v":"Drive type"},{"$f":"TypeListTemplate!G5","v":0},{"$f":"TypeListTemplate!H5","v":"Drive type"},{"$f":"TypeListTemplate!I5","v":0},{"$f":"TypeListTemplate!J5","v":"Drive type"},{"$f":"TypeListTemplate!K5","v":0},{"$f":"TypeListTemplate!L5","v":"Drive type"},{"$f":"TypeListTemplate!M5","v":0},{"$f":"TypeListTemplate!N5","v":"Drive type"},{"$f":"TypeListTemplate!O5","v":0},{"$f":"TypeListTemplate!P5","v":"Drive type"},{"$f":"TypeListTemplate!Q5","v":0}]
[{"$f":"TypeListTemplate!A6","v":"Hp"},{"$f":"TypeListTemplate!B6","v":"power kW"}]
[{"$f":"TypeListTemplate!A7","v":0},{"$f":"TypeListTemplate!B7","v":"Column Ordinal ->"},{"$f":"TypeListTemplate!C7","v":1},{"$f":"TypeListTemplate!D7","v":2},{"$f":"TypeListTemplate!E7","v":3},{"$f":"TypeListTemplate!F7","v":4},{"$f":"TypeListTemplate!G7","v":5},{"$f":"TypeListTemplate!H7","v":6},{"$f":"TypeListTemplate!I7","v":7},{"$f":"TypeListTemplate!J7","v":8},{"$f":"TypeListTemplate!K7","v":9},{"$f":"TypeListTemplate!L7","v":10},{"$f":"TypeListTemplate!M7","v":11},{"$f":"TypeListTemplate!N7","v":12},{"$f":"TypeListTemplate!O7","v":13},{"$f":"TypeListTemplate!P7","v":14},{"$f":"TypeListTemplate!Q7","v":15}]
[{"$f":"TypeListTemplate!A8","v":0},{"$f":"TypeListTemplate!B8","v":0},{"$f":"TypeListTemplate!C8","v":0}]
[{"$f":"TypeListTemplate!A9","v":7.3756202226096287E-2},{"$f":"TypeListTemplate!B9","v":5.5E-2},{"$f":"TypeListTemplate!C9","v":0.01}]
[{"$f":"TypeListTemplate!A10","v":0.12069196727906664},{"$f":"TypeListTemplate!B10","v":0.09},{"$f":"TypeListTemplate!C10","v":6.5000000000000002E-2}]
[{"$f":"TypeListTemplate!A11","v":0.16092262303875551},{"$f":"TypeListTemplate!B11","v":0.12},{"$f":"TypeListTemplate!C11","v":9.9999999999999992E-2}]
[{"$f":"TypeListTemplate!A12","v":0.24138393455813328},{"$f":"TypeListTemplate!B12","v":0.18},{"$f":"TypeListTemplate!C12","v":0.13}]
[{"$f":"TypeListTemplate!A13","v":0.49617808770282951},{"$f":"TypeListTemplate!B13","v":0.37},{"$f":"TypeListTemplate!C13","v":0.19}]
[{"$f":"TypeListTemplate!A14","v":0.7375620222609629},{"$f":"TypeListTemplate!B14","v":0.55000000000000004},{"$f":"TypeListTemplate!C14","v":0.38}]
[{"$f":"TypeListTemplate!A15","v":1.0057663939922221},{"$f":"TypeListTemplate!B15","v":0.75},{"$f":"TypeListTemplate!C15","v":0.56000000000000005}]
[{"$f":"TypeListTemplate!A16","v":1.4751240445219258},{"$f":"TypeListTemplate!B16","v":1.1000000000000001},{"$f":"TypeListTemplate!C16","v":0.76},null,null,null,null,null,null,"ACQ810-04-02A7-4",null,"ACQ810-04-02A7-4"]
[{"$f":"TypeListTemplate!A17","v":2.0115327879844442},{"$f":"TypeListTemplate!B17","v":1.5},{"$f":"TypeListTemplate!C17","v":1.1100000000000001},null,null,null,null,null,null,"ACQ810-04-03A5-4",null,"ACQ810-04-03A5-4"]
[{"$f":"TypeListTemplate!A18","v":2.9502480890438516},{"$f":"TypeListTemplate!B18","v":2.2000000000000002},{"$f":"TypeListTemplate!C18","v":1.51},null,null,null,null,null,null,"ACQ810-04-04A9-4",null,"ACQ810-04-04A9-4"]
[{"$f":"TypeListTemplate!A19","v":4.0230655759688885},{"$f":"TypeListTemplate!B19","v":3},{"$f":"TypeListTemplate!C19","v":2.21},null,null,null,null,null,null,"ACQ810-04-06A3-4",null,"ACQ810-04-06A3-4"]
[{"$f":"TypeListTemplate!A20","v":5},{"$f":"TypeListTemplate!B20","v":3.7285000000000004},{"$f":"TypeListTemplate!C20","v":3.01}]
[{"$f":"TypeListTemplate!A21","v":5.3640874346251843},{"$f":"TypeListTemplate!B21","v":4},{"$f":"TypeListTemplate!C21","v":3.7385000000000002},null,null,null,null,null,null,"ACQ810-04-08A3-4",null,"ACQ810-04-08A3-4"]
[{"$f":"TypeListTemplate!A22","v":7.3756202226096281},{"$f":"TypeListTemplate!B22","v":5.5},{"$f":"TypeListTemplate!C22","v":4.01},null,null,null,null,null,null,"ACQ810-04-11A0-4",null,"ACQ810-04-11A0-4"]
[{"$f":"TypeListTemplate!A23","v":10.05766393992222},{"$f":"TypeListTemplate!B23","v":7.5},{"$f":"TypeListTemplate!C23","v":5.51},null,null,null,null,null,null,"ACQ810-04-14A4-4",null,"ACQ810-04-14A4-4"]
[{"$f":"TypeListTemplate!A24","v":14.751240445219256},{"$f":"TypeListTemplate!B24","v":11},{"$f":"TypeListTemplate!C24","v":7.51},null,null,null,null,null,null,"ACQ810-04-021A-4",null,"ACQ810-04-021A-4"]
[{"$f":"TypeListTemplate!A25","v":20.11532787984444},{"$f":"TypeListTemplate!B25","v":15},{"$f":"TypeListTemplate!C25","v":11.01},null,null,null,null,null,null,"ACQ810-04-028A-4",null,"ACQ810-04-028A-4"]
[{"$f":"TypeListTemplate!A26","v":24.808904385141478},{"$f":"TypeListTemplate!B26","v":18.5},{"$f":"TypeListTemplate!C26","v":15.01},null,null,null,null,null,null,"ACQ810-04-035A-4",null,"ACQ810-04-035A-4"]
[{"$f":"TypeListTemplate!A27","v":29.502480890438513},{"$f":"TypeListTemplate!B27","v":22},{"$f":"TypeListTemplate!C27","v":18.510000000000002},null,null,null,null,null,null,"ACQ810-04-040A-4",null,"ACQ810-04-040A-4"]
[{"$f":"TypeListTemplate!A28","v":40.230655759688879},{"$f":"TypeListTemplate!B28","v":30},{"$f":"TypeListTemplate!C28","v":22.01},null,null,null,null,null,null,"ACQ810-04-053A-4",null,"ACQ810-04-053A-4"]
[{"$f":"TypeListTemplate!A29","v":49.617808770282956},{"$f":"TypeListTemplate!B29","v":37},{"$f":"TypeListTemplate!C29","v":30.01},null,null,null,null,null,null,"ACQ810-04-067A-4",null,"ACQ810-04-067A-4"]
[{"$f":"TypeListTemplate!A30","v":60.345983639533323},{"$f":"TypeListTemplate!B30","v":45},{"$f":"TypeListTemplate!C30","v":37.01},null,null,null,null,null,null,"ACQ810-04-080A-4",null,"ACQ810-04-080A-4"]
[{"$f":"TypeListTemplate!A31","v":73.756202226096278},{"$f":"TypeListTemplate!B31","v":55},{"$f":"TypeListTemplate!C31","v":45.01},null,null,null,null,null,null,"ACQ810-04-098A-4",null,"ACQ810-04-098A-4"]
[{"$f":"TypeListTemplate!A32","v":100.5766393992222},{"$f":"TypeListTemplate!B32","v":75},{"$f":"TypeListTemplate!C32","v":55.01},null,null,null,null,null,null,"ACQ810-04-138A-4",null,"ACQ810-04-138A-4"]
[{"$f":"TypeListTemplate!A33","v":120.69196727906665},{"$f":"TypeListTemplate!B33","v":90},{"$f":"TypeListTemplate!C33","v":75.010000000000005},null,null,null,null,null,null,"ACQ810-04-162A-4",null,"ACQ810-04-162A-4"]
[{"$f":"TypeListTemplate!A34","v":147.51240445219256},{"$f":"TypeListTemplate!B34","v":110},{"$f":"TypeListTemplate!C34","v":90.01},null,null,null,null,null,null,"ACQ810-04-203A-4",null,"ACQ810-04-203A-4"]
[{"$f":"TypeListTemplate!A35","v":177.01488534263109},{"$f":"TypeListTemplate!B35","v":132},{"$f":"TypeListTemplate!C35","v":110.01},null,null,null,null,null,null,"ACQ810-04-240A-4",null,"ACQ810-04-240A-4"]
[{"$f":"TypeListTemplate!A36","v":200},{"$f":"TypeListTemplate!B36","v":149.14000000000001},{"$f":"TypeListTemplate!C36","v":132.01}]
[{"$f":"TypeListTemplate!A37","v":214.56349738500737},{"$f":"TypeListTemplate!B37","v":160},{"$f":"TypeListTemplate!C37","v":149.15},null,null,null,null,null,null,"ACQ810-04-286A-4",null,"ACQ810-04-286A-4"]
[{"$f":"TypeListTemplate!A38","v":250},{"$f":"TypeListTemplate!B38","v":186.42500000000001},{"$f":"TypeListTemplate!C38","v":160.01}]
[{"$f":"TypeListTemplate!A39","v":268.20437173125919},{"$f":"TypeListTemplate!B39","v":200},{"$f":"TypeListTemplate!C39","v":186.435},null,null,null,null,null,null,"ACQ810-04-377A-4",null,"ACQ810-04-377A-4"]
[{"$f":"TypeListTemplate!A40","v":300},{"$f":"TypeListTemplate!B40","v":223.71},{"$f":"TypeListTemplate!C40","v":200.01}]
[{"$f":"TypeListTemplate!A41","v":335.255464664074},{"$f":"TypeListTemplate!B41","v":250},{"$f":"TypeListTemplate!C41","v":223.72},null,null,null,null,null,null,"ACQ810-04-480A-4",null,"ACQ810-04-480A-4"]
[{"$f":"TypeListTemplate!A42","v":400},{"$f":"TypeListTemplate!B42","v":298.28000000000003},{"$f":"TypeListTemplate!C42","v":250.01}]
[{"$f":"TypeListTemplate!A43","v":422.42188547673328},{"$f":"TypeListTemplate!B43","v":315},{"$f":"TypeListTemplate!C43","v":298.29000000000002},null,null,null,null,null,null,"ACQ810-04-570A-4",null,"ACQ810-04-570A-4"]
[{"$f":"TypeListTemplate!A44","v":476.06275982298507},{"$f":"TypeListTemplate!B44","v":355},{"$f":"TypeListTemplate!C44","v":315.01},null,null,null,null,null,null,"ACQ810-04-634A-4",null,"ACQ810-04-634A-4"]
[{"$f":"TypeListTemplate!A45","v":536.40874346251837},{"$f":"TypeListTemplate!B45","v":400},{"$f":"TypeListTemplate!C45","v":355.01},null,null,null,null,null,null,"ACQ810-04-700A-4",null,"ACQ810-04-700A-4"]
[{"$f":"TypeListTemplate!A46","v":603.45983639533324},{"$f":"TypeListTemplate!B46","v":450},{"$f":"TypeListTemplate!C46","v":400.01}]
[{"$f":"TypeListTemplate!A47","v":670.51092932814799},{"$f":"TypeListTemplate!B47","v":500},{"$f":"TypeListTemplate!C47","v":450.01}]
[{"$f":"TypeListTemplate!A48","v":750.97224084752577},{"$f":"TypeListTemplate!B48","v":560},{"$f":"TypeListTemplate!C48","v":500.01}]
[{"$f":"TypeListTemplate!A49","v":844.84377095346656},{"$f":"TypeListTemplate!B49","v":630},{"$f":"TypeListTemplate!C49","v":560.01}]
[{"$f":"TypeListTemplate!A50","v":952.12551964597014},{"$f":"TypeListTemplate!B50","v":710},{"$f":"TypeListTemplate!C50","v":630.01}]
[{"$f":"TypeListTemplate!A51","v":1072.8174869250367},{"$f":"TypeListTemplate!B51","v":800},{"$f":"TypeListTemplate!C51","v":710.01}]
[{"$f":"TypeListTemplate!A52","v":1206.9196727906665},{"$f":"TypeListTemplate!B52","v":900},{"$f":"TypeListTemplate!C52","v":800.01}]
[{"$f":"TypeListTemplate!A53","v":1341.021858656296},{"$f":"TypeListTemplate!B53","v":1000},{"$f":"TypeListTemplate!C53","v":900.01}]
[{"$f":"TypeListTemplate!A54","v":1501.9444816950515},{"$f":"TypeListTemplate!B54","v":1120},{"$f":"TypeListTemplate!C54","v":1000.01}]
[{"$f":"TypeListTemplate!A55","v":1676.27732332037},{"$f":"TypeListTemplate!B55","v":1250},{"$f":"TypeListTemplate!C55","v":1120.01}]
[{"$f":"TypeListTemplate!A56","v":1877.4306021188145},{"$f":"TypeListTemplate!B56","v":1400},{"$f":"TypeListTemplate!C56","v":1250.01}]
[{"$f":"TypeListTemplate!A57","v":2145.6349738500735},{"$f":"TypeListTemplate!B57","v":1600},{"$f":"TypeListTemplate!C57","v":1400.01}]
[{"$f":"TypeListTemplate!A58","v":2346.7882526485182},{"$f":"TypeListTemplate!B58","v":1750},{"$f":"TypeListTemplate!C58","v":1600.01}]
[{"$f":"TypeListTemplate!A59","v":2413.839345581333},{"$f":"TypeListTemplate!B59","v":1800},{"$f":"TypeListTemplate!C59","v":1750.01}]
[{"$f":"TypeListTemplate!A60","v":2682.043717312592},{"$f":"TypeListTemplate!B60","v":2000},{"$f":"TypeListTemplate!C60","v":1800.01}]
[{"$f":"TypeListTemplate!A61","v":2950.2480890438515},{"$f":"TypeListTemplate!B61","v":2200},{"$f":"TypeListTemplate!C61","v":2000.01}]
[{"$f":"TypeListTemplate!A62","v":3017.2991819766662},{"$f":"TypeListTemplate!B62","v":2250},{"$f":"TypeListTemplate!C62","v":2200.0100000000002}]
[{"$f":"TypeListTemplate!A63","v":3084.350274909481},{"$f":"TypeListTemplate!B63","v":2300},{"$f":"TypeListTemplate!C63","v":2250.0100000000002}]
[{"$f":"TypeListTemplate!A64","v":3352.55464664074},{"$f":"TypeListTemplate!B64","v":2500},{"$f":"TypeListTemplate!C64","v":2300.0100000000002}]
[{"$f":"TypeListTemplate!A65","v":3754.861204237629},{"$f":"TypeListTemplate!B65","v":2800},{"$f":"TypeListTemplate!C65","v":2500.0100000000002}]
[{"$f":"TypeListTemplate!A66","v":4224.2188547673322},{"$f":"TypeListTemplate!B66","v":3150},{"$f":"TypeListTemplate!C66","v":2800.01}]
[{"$f":"TypeListTemplate!A67","v":4760.6275982298512},{"$f":"TypeListTemplate!B67","v":3550},{"$f":"TypeListTemplate!C67","v":3150.01}]
[{"$f":"TypeListTemplate!A68","v":5364.087434625184},{"$f":"TypeListTemplate!B68","v":4000},{"$f":"TypeListTemplate!C68","v":3550.01}]
[{"$f":"TypeListTemplate!A69","v":6034.5983639533324},{"$f":"TypeListTemplate!B69","v":4500},{"$f":"TypeListTemplate!C69","v":4000.01}]
[{"$f":"TypeListTemplate!A70","v":6705.1092932814799},{"$f":"TypeListTemplate!B70","v":5000},{"$f":"TypeListTemplate!C70","v":4500.01}]
[{"$f":"TypeListTemplate!A71","v":0},{"$f":"TypeListTemplate!B71","v":999999999},{"$f":"TypeListTemplate!C71","v":5000.01}]
[{"$f":"TypeListTemplate!A72","v":0},{"$f":"TypeListTemplate!B72","v":0},{"$f":"TypeListTemplate!C72","v":0}]
[{"$f":"TypeListTemplate!A73","v":0},{"$f":"TypeListTemplate!B73","v":0},{"$f":"TypeListTemplate!C73","v":0},{"$f":"TypeListTemplate!D73","v":"Drive type"},{"$f":"TypeListTemplate!E73","v":0},{"$f":"TypeListTemplate!F73","v":"Drive type"},{"$f":"TypeListTemplate!G73","v":0},{"$f":"TypeListTemplate!H73","v":"Drive type"},{"$f":"TypeListTemplate!I73","v":0},{"$f":"TypeListTemplate!J73","v":"Drive type"},{"$f":"TypeListTemplate!K73","v":0},{"$f":"TypeListTemplate!L73","v":"Drive type"},{"$f":"TypeListTemplate!M73","v":0},{"$f":"TypeListTemplate!N73","v":"Drive type"},{"$f":"TypeListTemplate!O73","v":0},{"$f":"TypeListTemplate!P73","v":"Drive type"},{"$f":"TypeListTemplate!Q73","v":0}]
[{"$f":"TypeListTemplate!A74","v":0},{"$f":"TypeListTemplate!B74","v":0},{"$f":"TypeListTemplate!C74","v":0},{"$f":"TypeListTemplate!D74","v":" 115 V (1-ph)"},{"$f":"TypeListTemplate!E74","v":0},{"$f":"TypeListTemplate!F74","v":" 230 V (1-ph)"},{"$f":"TypeListTemplate!G74","v":0},{"$f":"TypeListTemplate!H74","v":" 230 V (3-ph)"},{"$f":"TypeListTemplate!I74","v":0},{"$f":"TypeListTemplate!J74","v":" 400 V"},{"$f":"TypeListTemplate!K74","v":0},{"$f":"TypeListTemplate!L74","v":" 460 V"},{"$f":"TypeListTemplate!M74","v":0},{"$f":"TypeListTemplate!N74","v":" 500 V"},{"$f":"TypeListTemplate!O74","v":0},{"$f":"TypeListTemplate!P74","v":" 690 V"},{"$f":"TypeListTemplate!Q74","v":0}]
[{"$f":"TypeListTemplate!A75","v":0},{"$f":"TypeListTemplate!B75","v":0},{"$f":"TypeListTemplate!C75","v":0},{"$f":"TypeListTemplate!D75","v":0},{"$f":"TypeListTemplate!E75","v":0},{"$f":"TypeListTemplate!F75","v":0},{"$f":"TypeListTemplate!G75","v":0},{"$f":"TypeListTemplate!H75","v":0},{"$f":"TypeListTemplate!I75","v":0},{"$f":"TypeListTemplate!J75","v":0},{"$f":"TypeListTemplate!K75","v":0},{"$f":"TypeListTemplate!L75","v":0},{"$f":"TypeListTemplate!M75","v":0},{"$f":"TypeListTemplate!N75","v":0},{"$f":"TypeListTemplate!O75","v":0},{"$f":"TypeListTemplate!P75","v":0},{"$f":"TypeListTemplate!Q75","v":0}]
[{"$f":"TypeListTemplate!A76","v":0},{"$f":"TypeListTemplate!B76","v":0},{"$f":"TypeListTemplate!C76","v":0},{"$f":"TypeListTemplate!D76","v":0},{"$f":"TypeListTemplate!E76","v":0},{"$f":"TypeListTemplate!F76","v":0},{"$f":"TypeListTemplate!G76","v":0},{"$f":"TypeListTemplate!H76","v":0},{"$f":"TypeListTemplate!I76","v":0},{"$f":"TypeListTemplate!J76","v":0},{"$f":"TypeListTemplate!K76","v":0},{"$f":"TypeListTemplate!L76","v":0},{"$f":"TypeListTemplate!M76","v":0},{"$f":"TypeListTemplate!N76","v":0},{"$f":"TypeListTemplate!O76","v":0},{"$f":"TypeListTemplate!P76","v":0},{"$f":"TypeListTemplate!Q76","v":0}]
[{"$f":"TypeListTemplate!A77","v":0},{"$f":"TypeListTemplate!B77","v":0},{"$f":"TypeListTemplate!C77","v":0},{"$f":"TypeListTemplate!D77","v":0},{"$f":"TypeListTemplate!E77","v":0},{"$f":"TypeListTemplate!F77","v":0},{"$f":"TypeListTemplate!G77","v":0},{"$f":"TypeListTemplate!H77","v":0},{"$f":"TypeListTemplate!I77","v":0},{"$f":"TypeListTemplate!J77","v":0},{"$f":"TypeListTemplate!K77","v":0},{"$f":"TypeListTemplate!L77","v":0},{"$f":"TypeListTemplate!M77","v":0},{"$f":"TypeListTemplate!N77","v":0},{"$f":"TypeListTemplate!O77","v":0},{"$f":"TypeListTemplate!P77","v":0},{"$f":"TypeListTemplate!Q77","v":0}]
[{"$f":"TypeListTemplate!A78","v":0},{"$f":"TypeListTemplate!B78","v":0},{"$f":"TypeListTemplate!C78","v":0},{"$f":"TypeListTemplate!D78","v":0},{"$f":"TypeListTemplate!E78","v":0},{"$f":"TypeListTemplate!F78","v":0},{"$f":"TypeListTemplate!G78","v":0},{"$f":"TypeListTemplate!H78","v":0},{"$f":"TypeListTemplate!I78","v":0},{"$f":"TypeListTemplate!J78","v":0},{"$f":"TypeListTemplate!K78","v":0},{"$f":"TypeListTemplate!L78","v":0},{"$f":"TypeListTemplate!M78","v":0},{"$f":"TypeListTemplate!N78","v":0},{"$f":"TypeListTemplate!O78","v":0},{"$f":"TypeListTemplate!P78","v":0},{"$f":"TypeListTemplate!Q78","v":0}]
[{"$f":"TypeListTemplate!A79","v":0},{"$f":"TypeListTemplate!B79","v":0},{"$f":"TypeListTemplate!C79","v":0},{"$f":"TypeListTemplate!D79","v":0},{"$f":"TypeListTemplate!E79","v":0},{"$f":"TypeListTemplate!F79","v":0},{"$f":"TypeListTemplate!G79","v":0},{"$f":"TypeListTemplate!H79","v":0},{"$f":"TypeListTemplate!I79","v":0},{"$f":"TypeListTemplate!J79","v":0},{"$f":"TypeListTemplate!K79","v":0},{"$f":"TypeListTemplate!L79","v":0},{"$f":"TypeListTemplate!M79","v":0},{"$f":"TypeListTemplate!N79","v":0},{"$f":"TypeListTemplate!O79","v":0},{"$f":"TypeListTemplate!P79","v":0},{"$f":"TypeListTemplate!Q79","v":0}]
[{"$f":"TypeListTemplate!A80","v":0},{"$f":"TypeListTemplate!B80","v":0},{"$f":"TypeListTemplate!C80","v":0},{"$f":"TypeListTemplate!D80","v":0},{"$f":"TypeListTemplate!E80","v":0},{"$f":"TypeListTemplate!F80","v":0},{"$f":"TypeListTemplate!G80","v":0},{"$f":"TypeListTemplate!H80","v":0},{"$f":"TypeListTemplate!I80","v":0},{"$f":"TypeListTemplate!J80","v":0},{"$f":"TypeListTemplate!K80","v":0},{"$f":"TypeListTemplate!L80","v":0},{"$f":"TypeListTemplate!M80","v":0},{"$f":"TypeListTemplate!N80","v":0},{"$f":"TypeListTemplate!O80","v":0},{"$f":"TypeListTemplate!P80","v":0},{"$f":"TypeListTemplate!Q80","v":0}]
[{"$f":"TypeListTemplate!A81","v":0},{"$f":"TypeListTemplate!B81","v":0},{"$f":"TypeListTemplate!C81","v":0},{"$f":"TypeListTemplate!D81","v":0},{"$f":"TypeListTemplate!E81","v":0},{"$f":"TypeListTemplate!F81","v":0},{"$f":"TypeListTemplate!G81","v":0},{"$f":"TypeListTemplate!H81","v":0},{"$f":"TypeListTemplate!I81","v":0},{"$f":"TypeListTemplate!J81","v":0},{"$f":"TypeListTemplate!K81","v":0},{"$f":"TypeListTemplate!L81","v":0},{"$f":"TypeListTemplate!M81","v":0},{"$f":"TypeListTemplate!N81","v":0},{"$f":"TypeListTemplate!O81","v":0},{"$f":"TypeListTemplate!P81","v":0},{"$f":"TypeListTemplate!Q81","v":0}]
[{"$f":"TypeListTemplate!A82","v":0},{"$f":"TypeListTemplate!B82","v":0},{"$f":"TypeListTemplate!C82","v":0},{"$f":"TypeListTemplate!D82","v":0},{"$f":"TypeListTemplate!E82","v":0},{"$f":"TypeListTemplate!F82","v":0},{"$f":"TypeListTemplate!G82","v":0},{"$f":"TypeListTemplate!H82","v":0},{"$f":"TypeListTemplate!I82","v":0},{"$f":"TypeListTemplate!J82","v":0},{"$f":"TypeListTemplate!K82","v":0},{"$f":"TypeListTemplate!L82","v":0},{"$f":"TypeListTemplate!M82","v":0},{"$f":"TypeListTemplate!N82","v":0},{"$f":"TypeListTemplate!O82","v":0},{"$f":"TypeListTemplate!P82","v":0},{"$f":"TypeListTemplate!Q82","v":0}]
[{"$f":"TypeListTemplate!A83","v":0},{"$f":"TypeListTemplate!B83","v":0},{"$f":"TypeListTemplate!C83","v":0},{"$f":"TypeListTemplate!D83","v":0},{"$f":"TypeListTemplate!E83","v":0},{"$f":"TypeListTemplate!F83","v":0},{"$f":"TypeListTemplate!G83","v":0},{"$f":"TypeListTemplate!H83","v":0},{"$f":"TypeListTemplate!I83","v":0},{"$f":"TypeListTemplate!J83","v":0},{"$f":"TypeListTemplate!K83","v":0},{"$f":"TypeListTemplate!L83","v":0},{"$f":"TypeListTemplate!M83","v":0},{"$f":"TypeListTemplate!N83","v":0},{"$f":"TypeListTemplate!O83","v":0},{"$f":"TypeListTemplate!P83","v":0},{"$f":"TypeListTemplate!Q83","v":0}]
[{"$f":"TypeListTemplate!A84","v":0},{"$f":"TypeListTemplate!B84","v":0},{"$f":"TypeListTemplate!C84","v":0},{"$f":"TypeListTemplate!D84","v":0},{"$f":"TypeListTemplate!E84","v":0},{"$f":"TypeListTemplate!F84","v":0},{"$f":"TypeListTemplate!G84","v":0},{"$f":"TypeListTemplate!H84","v":0},{"$f":"TypeListTemplate!I84","v":0},{"$f":"TypeListTemplate!J84","v":0},{"$f":"TypeListTemplate!K84","v":0},{"$f":"TypeListTemplate!L84","v":0},{"$f":"TypeListTemplate!M84","v":0},{"$f":"TypeListTemplate!N84","v":0},{"$f":"TypeListTemplate!O84","v":0},{"$f":"TypeListTemplate!P84","v":0},{"$f":"TypeListTemplate!Q84","v":0}]
[{"$f":"TypeListTemplate!A85","v":0},{"$f":"TypeListTemplate!B85","v":0},{"$f":"TypeListTemplate!C85","v":0},{"$f":"TypeListTemplate!D85","v":0},{"$f":"TypeListTemplate!E85","v":0},{"$f":"TypeListTemplate!F85","v":0},{"$f":"TypeListTemplate!G85","v":0},{"$f":"TypeListTemplate!H85","v":0},{"$f":"TypeListTemplate!I85","v":0},{"$f":"TypeListTemplate!J85","v":0},{"$f":"TypeListTemplate!K85","v":0},{"$f":"TypeListTemplate!L85","v":0},{"$f":"TypeListTemplate!M85","v":0},{"$f":"TypeListTemplate!N85","v":0},{"$f":"TypeListTemplate!O85","v":0},{"$f":"TypeListTemplate!P85","v":0},{"$f":"TypeListTemplate!Q85","v":0}]
[{"$f":"TypeListTemplate!A86","v":0},{"$f":"TypeListTemplate!B86","v":0},{"$f":"TypeListTemplate!C86","v":0},{"$f":"TypeListTemplate!D86","v":0},{"$f":"TypeListTemplate!E86","v":0},{"$f":"TypeListTemplate!F86","v":0},{"$f":"TypeListTemplate!G86","v":0},{"$f":"TypeListTemplate!H86","v":0},{"$f":"TypeListTemplate!I86","v":0},{"$f":"TypeListTemplate!J86","v":0},{"$f":"TypeListTemplate!K86","v":0},{"$f":"TypeListTemplate!L86","v":0},{"$f":"TypeListTemplate!M86","v":0},{"$f":"TypeListTemplate!N86","v":0},{"$f":"TypeListTemplate!O86","v":0},{"$f":"TypeListTemplate!P86","v":0},{"$f":"TypeListTemplate!Q86","v":0}]
[{"$f":"TypeListTemplate!A87","v":0},{"$f":"TypeListTemplate!B87","v":0},{"$f":"TypeListTemplate!C87","v":0},{"$f":"TypeListTemplate!D87","v":0},{"$f":"TypeListTemplate!E87","v":0},{"$f":"TypeListTemplate!F87","v":0},{"$f":"TypeListTemplate!G87","v":0},{"$f":"TypeListTemplate!H87","v":0},{"$f":"TypeListTemplate!I87","v":0},{"$f":"TypeListTemplate!J87","v":0},{"$f":"TypeListTemplate!K87","v":0},{"$f":"TypeListTemplate!L87","v":0},{"$f":"TypeListTemplate!M87","v":0},{"$f":"TypeListTemplate!N87","v":0},{"$f":"TypeListTemplate!O87","v":0},{"$f":"TypeListTemplate!P87","v":0},{"$f":"TypeListTemplate!Q87","v":0}]
[{"$f":"TypeListTemplate!A88","v":0},{"$f":"TypeListTemplate!B88","v":0},{"$f":"TypeListTemplate!C88","v":0},{"$f":"TypeListTemplate!D88","v":0},{"$f":"TypeListTemplate!E88","v":0},{"$f":"TypeListTemplate!F88","v":0},{"$f":"TypeListTemplate!G88","v":0},{"$f":"TypeListTemplate!H88","v":0},{"$f":"TypeListTemplate!I88","v":0},{"$f":"TypeListTemplate!J88","v":0},{"$f":"TypeListTemplate!K88","v":0},{"$f":"TypeListTemplate!L88","v":0},{"$f":"TypeListTemplate!M88","v":0},{"$f":"TypeListTemplate!N88","v":0},{"$f":"TypeListTemplate!O88","v":0},{"$f":"TypeListTemplate!P88","v":0},{"$f":"TypeListTemplate!Q88","v":0}]
[{"$f":"TypeListTemplate!A89","v":0},{"$f":"TypeListTemplate!B89","v":0},{"$f":"TypeListTemplate!C89","v":0},{"$f":"TypeListTemplate!D89","v":0},{"$f":"TypeListTemplate!E89","v":0},{"$f":"TypeListTemplate!F89","v":0},{"$f":"TypeListTemplate!G89","v":0},{"$f":"TypeListTemplate!H89","v":0},{"$f":"TypeListTemplate!I89","v":0},{"$f":"TypeListTemplate!J89","v":0},{"$f":"TypeListTemplate!K89","v":0},{"$f":"TypeListTemplate!L89","v":0},{"$f":"TypeListTemplate!M89","v":0},{"$f":"TypeListTemplate!N89","v":0},{"$f":"TypeListTemplate!O89","v":0},{"$f":"TypeListTemplate!P89","v":0},{"$f":"TypeListTemplate!Q89","v":0}]
[{"$f":"TypeListTemplate!A90","v":0},{"$f":"TypeListTemplate!B90","v":0},{"$f":"TypeListTemplate!C90","v":0},{"$f":"TypeListTemplate!D90","v":0},{"$f":"TypeListTemplate!E90","v":0},{"$f":"TypeListTemplate!F90","v":0},{"$f":"TypeListTemplate!G90","v":0},{"$f":"TypeListTemplate!H90","v":0},{"$f":"TypeListTemplate!I90","v":0},{"$f":"TypeListTemplate!J90","v":0},{"$f":"TypeListTemplate!K90","v":0},{"$f":"TypeListTemplate!L90","v":0},{"$f":"TypeListTemplate!M90","v":0},{"$f":"TypeListTemplate!N90","v":0},{"$f":"TypeListTemplate!O90","v":0},{"$f":"TypeListTemplate!P90","v":0},{"$f":"TypeListTemplate!Q90","v":0}]
[{"$f":"TypeListTemplate!A91","v":0},{"$f":"TypeListTemplate!B91","v":0},{"$f":"TypeListTemplate!C91","v":0},{"$f":"TypeListTemplate!D91","v":0},{"$f":"TypeListTemplate!E91","v":0},{"$f":"TypeListTemplate!F91","v":0},{"$f":"TypeListTemplate!G91","v":0},{"$f":"TypeListTemplate!H91","v":0},{"$f":"TypeListTemplate!I91","v":0},{"$f":"TypeListTemplate!J91","v":0},{"$f":"TypeListTemplate!K91","v":0},{"$f":"TypeListTemplate!L91","v":0},{"$f":"TypeListTemplate!M91","v":0},{"$f":"TypeListTemplate!N91","v":0},{"$f":"TypeListTemplate!O91","v":0},{"$f":"TypeListTemplate!P91","v":0},{"$f":"TypeListTemplate!Q91","v":0}]
[{"$f":"TypeListTemplate!A92","v":0},{"$f":"TypeListTemplate!B92","v":0},{"$f":"TypeListTemplate!C92","v":0},{"$f":"TypeListTemplate!D92","v":0},{"$f":"TypeListTemplate!E92","v":0},{"$f":"TypeListTemplate!F92","v":0},{"$f":"TypeListTemplate!G92","v":0},{"$f":"TypeListTemplate!H92","v":0},{"$f":"TypeListTemplate!I92","v":0},{"$f":"TypeListTemplate!J92","v":0},{"$f":"TypeListTemplate!K92","v":0},{"$f":"TypeListTemplate!L92","v":0},{"$f":"TypeListTemplate!M92","v":0},{"$f":"TypeListTemplate!N92","v":0},{"$f":"TypeListTemplate!O92","v":0},{"$f":"TypeListTemplate!P92","v":0},{"$f":"TypeListTemplate!Q92","v":0}]
[{"$f":"TypeListTemplate!A93","v":0},{"$f":"TypeListTemplate!B93","v":0},{"$f":"TypeListTemplate!C93","v":0},{"$f":"TypeListTemplate!D93","v":0},{"$f":"TypeListTemplate!E93","v":0},{"$f":"TypeListTemplate!F93","v":0},{"$f":"TypeListTemplate!G93","v":0},{"$f":"TypeListTemplate!H93","v":0},{"$f":"TypeListTemplate!I93","v":0},{"$f":"TypeListTemplate!J93","v":0},{"$f":"TypeListTemplate!K93","v":0},{"$f":"TypeListTemplate!L93","v":0},{"$f":"TypeListTemplate!M93","v":0},{"$f":"TypeListTemplate!N93","v":0},{"$f":"TypeListTemplate!O93","v":0},{"$f":"TypeListTemplate!P93","v":0},{"$f":"TypeListTemplate!Q93","v":0}]
[{"$f":"TypeListTemplate!A94","v":0},{"$f":"TypeListTemplate!B94","v":0},{"$f":"TypeListTemplate!C94","v":0},{"$f":"TypeListTemplate!D94","v":0},{"$f":"TypeListTemplate!E94","v":0},{"$f":"TypeListTemplate!F94","v":0},{"$f":"TypeListTemplate!G94","v":0},{"$f":"TypeListTemplate!H94","v":0},{"$f":"TypeListTemplate!I94","v":0},{"$f":"TypeListTemplate!J94","v":0},{"$f":"TypeListTemplate!K94","v":0},{"$f":"TypeListTemplate!L94","v":0},{"$f":"TypeListTemplate!M94","v":0},{"$f":"TypeListTemplate!N94","v":0},{"$f":"TypeListTemplate!O94","v":0},{"$f":"TypeListTemplate!P94","v":0},{"$f":"TypeListTemplate!Q94","v":0}]
[{"$f":"TypeListTemplate!A95","v":0},{"$f":"TypeListTemplate!B95","v":0},{"$f":"TypeListTemplate!C95","v":0},{"$f":"TypeListTemplate!D95","v":0},{"$f":"TypeListTemplate!E95","v":0},{"$f":"TypeListTemplate!F95","v":0},{"$f":"TypeListTemplate!G95","v":0},{"$f":"TypeListTemplate!H95","v":0},{"$f":"TypeListTemplate!I95","v":0},{"$f":"TypeListTemplate!J95","v":0},{"$f":"TypeListTemplate!K95","v":0},{"$f":"TypeListTemplate!L95","v":0},{"$f":"TypeListTemplate!M95","v":0},{"$f":"TypeListTemplate!N95","v":0},{"$f":"TypeListTemplate!O95","v":0},{"$f":"TypeListTemplate!P95","v":0},{"$f":"TypeListTemplate!Q95","v":0}]

{"sheet":"StdDrives","index":13,"n_rows":95,"n_cols":25,"rows_kept":95,"cut":false,"hidden":true,"merged":[]}
["Typecode","Prod.class",null,"Voltage range 1",null,"Voltage range 2 (1-ph)",null,"Voltage range 2",null,"Voltage range 3",null,"Voltage range 4.6",null,"Voltage range 5",null,"Voltage range 7/6",null,"Voltage range 2k",null,"Voltage range 3k",null,"Voltage range 4k",null,"Voltage range 6k"]
[{"$f":"VLOOKUP(DriveSel!E20,C8:Y71,DriveSel!D18)","v":"ACH550-01-246A-4"},0,"non-US (50Hz)"," 115 V (1-ph)",null," 230 V (1-ph)",null," 230 V (3-ph)",null," 400 V",null," 460 V",null," 500 V",null," 690 V",null," 2,3 kV",null," 3,3 kV",null," 4,16 kV",null," 6,6 kV"]
["Col.ordinal","Col.ordinal"]
[null,null,"Alternatives:","115 V 1-ph",null,"200/208/230/240 V 1-ph",null,"200/208/230/240 V 3-ph",null,"380/400/415 V",null,"440/460/480 V",null,"500 V",null,"525/550/575/600/660/690 V",null,null,null,null,null,"3800/4000/4160V"]
["Motor Power","Motor",null,"Drive type",null,"Drive type",null,"Drive type",null,"Drive type",null,"Drive type",null,"Drive type",null,"Drive type",null,"Drive type",null,"Drive type",null,"Drive type"]
["Hp","power kW"]
[0,"Column Ordinal ->",1,2,3,4,5,6,7,8,9,10,11,12,13,14,15,16,17,18,19,20,21,22,0]
[0,0,0]
[7.3756202226096287E-2,5.5E-2,0.01]
[0.12069196727906664,0.09,6.5000000000000002E-2]
[0.16092262303875551,0.12,0.1]
[0.24138393455813328,0.18,0.13]
[0.49617808770282951,0.37,0.19]
[0.7375620222609629,0.55000000000000004,0.38,null,null,null,null,"ACH550-01-04A6-2"]
[1.0057663939922221,0.75,0.56000000000000005,null,null,null,null,"ACH550-01-04A6-2",null,"ACH550-01-02A4-4",null,"ACH550-01-02A4-4"]
[1.4751240445219258,1.1000000000000001,0.76,null,null,null,null,"ACH550-01-06A6-2",null,"ACH550-01-03A3-4",null,"ACH550-01-03A3-4"]
[2.0115327879844442,1.5,1.1100000000000001,null,null,null,null,"ACH550-01-07A5-2",null,"ACH550-01-04A1-4",null,"ACH550-01-04A1-4"]
[2.9502480890438516,2.2000000000000002,1.51,null,null,null,null,"ACH550-01-012A-2",null,"ACH550-01-05A4-4",null,"ACH550-01-05A4-4"]
[4.0230655759688885,3,2.21,null,null,null,null,"ACH550-01-017A-2",null,"ACH550-01-06A9-4",null,"ACH550-01-06A9-4"]
[5,3.7285000000000004,3.01,null,null,null,null,"ACH550-01-017A-2",null,"ACH550-01-08A8-4",null,"ACH550-01-06A9-4"]
[5.3640874346251843,4,3.7385000000000002,null,null,null,null,"ACH550-01-017A-2",null,"ACH550-01-08A8-4",null,"ACH550-01-08A8-4"]
[7.3756202226096281,5.5,4.01,null,null,null,null,"ACH550-01-024A-2",null,"ACH550-01-012A-4",null,"ACH550-01-012A-4"]
[10.05766393992222,7.5,5.51,null,null,null,null,"ACH550-01-031A-2",null,"ACH550-01-015A-4",null,"ACH550-01-015A-4"]
[14.751240445219256,11,7.51,null,null,null,null,"ACH550-01-046A-2",null,"ACH550-01-023A-4",null,"ACH550-01-023A-4"]
[20.11532787984444,15,11.01,null,null,null,null,"ACH550-01-059A-2",null,"ACH550-01-031A-4",null,"ACH550-01-031A-4"]
[24.808904385141478,18.5,15.01,null,null,null,null,"ACH550-01-075A-2",null,"ACH550-01-038A-4",null,"ACH550-01-038A-4"]
[29.502480890438513,22,18.510000000000002,null,null,null,null,"ACH550-01-088A-2",null,"ACH550-01-045A-4",null,"ACH550-01-045A-4"]
[40.230655759688879,30,22.01,null,null,null,null,"ACH550-01-114A-2",null,"ACH550-01-059A-4",null,"ACH550-01-059A-4"]
[49.617808770282956,37,30.01,null,null,null,null,"ACH550-01-143A-2",null,"ACH550-01-072A-4",null,"ACH550-01-072A-4"]
[60.345983639533323,45,37.01,null,null,null,null,"ACH550-01-178A-2",null,"ACH550-01-087A-4",null,"ACH550-01-087A-4"]
[73.756202226096278,55,45.01,null,null,null,null,"ACH550-01-221A-2",null,"ACH550-01-125A-4",null,"ACH550-01-087A-4"]
[100.5766393992222,75,55.01,null,null,null,null,"ACH550-01-248A-2",null,"ACH550-01-157A-4",null,"ACH550-01-125A-4"]
[120.69196727906665,90,75.010000000000005,null,null,null,null,null,null,"ACH550-01-180A-4",null,"ACH550-01-157A-4"]
[147.51240445219256,110,90.01,null,null,null,null,null,null,"ACH550-01-195A-4",null,"ACH550-01-180A-4"]
[177.01488534263109,132,110.01,null,null,null,null,null,null,"ACH550-01-246A-4",null,"ACH550-01-246A-4"]
[200,149.13999999999999,132.01,null,null,null,null,null,null,"ACH550-01-290A-4",null,"ACH550-01-246A-4"]
[214.56349738500737,160,149.15,null,null,null,null,null,null,"ACH550-01-290A-4",null,"ACH550-01-290A-4"]
[250,186.42500000000001,160.01,null,null,null,null,null,null,"ACH550-02-368A-4",null,"ACH550-02-368A-4"]
[268.20437173125919,200,186.435,null,null,null,null,null,null,"ACH550-02-368A-4",null,"ACH550-02-368A-4"]
[300,223.71,200.01,null,null,null,null,null,null,"ACH550-02-486A-4",null,"ACH550-02-368A-4"]
[335.255464664074,250,223.72,null,null,null,null,null,null,"ACH550-02-486A-4",null,"ACH550-02-486A-4"]
[400,298.27999999999997,250.01,null,null,null,null,null,null,"ACH550-02-526A-4",null,"ACH550-02-486A-4"]
[422.42188547673328,315,298.29000000000002,null,null,null,null,null,null,"ACH550-02-602A-4",null,"ACH550-02-526A-4"]
[476.06275982298507,355,315.01,null,null,null,null,null,null,"ACH550-02-645A-4",null,"ACH550-02-602A-4"]
[536.40874346251837,400,355.01,null,null,null,null,null,null,null,null,"ACH550-02-645A-4"]
[603.45983639533324,450,400.01]
[670.51092932814799,500,450.01]
[750.97224084752577,560,500.01]
[844.84377095346656,630,560.01]
[952.12551964597014,710,630.01]
[1072.8174869250367,800,710.01]
[1206.9196727906665,900,800.01]
[1341.021858656296,1000,900.01]
[1501.9444816950515,1120,1000.01]
[1676.27732332037,1250,1120.01]
[1877.4306021188145,1400,1250.01]
[2145.6349738500735,1600,1400.01]
[2346.7882526485182,1750,1600.01]
[2413.839345581333,1800,1750.01]
[2682.043717312592,2000,1800.01]
[2950.2480890438515,2200,2000.01]
[3017.2991819766662,2250,2200.0100000000002]
[3084.350274909481,2300,2250.0100000000002]
[3352.55464664074,2500,2300.0100000000002]
[3754.861204237629,2800,2500.0100000000002]
[4224.2188547673322,3150,2800.01]
[4760.6275982298512,3550,3150.01]
[5364.087434625184,4000,3550.01]
[6034.5983639533324,4500,4000.01]
[6705.1092932814799,5000,4500.01]
[0,999999999,5000.01]
[0,0,0]
[0,0,0,"Drive type",0,"Drive type",0,"Drive type",0,"Drive type",0,"Drive type",0,"Drive type",0,"Drive type",0,"Drive type",0,"Drive type",0,"Drive type",0,"Drive type",0]
[0,0,0," 115 V (1-ph)",0," 230 V (1-ph)",0," 230 V (3-ph)",0," 400 V",0," 460 V",0," 500 V",0," 690 V",0," 2,3 kV",0," 3,3 kV",0," 4,16 kV",0," 6,6 kV",0]
[0,0,0,0,0,0,0,0,0,0,0,0,0,0,0,0,0,0,0,0,0,0,0,0,0]
[0,0,0,0,0,0,0,0,0,0,0,0,0,0,0,0,0,0,0,0,0,0,0,0,0]
[0,0,0,0,0,0,0,0,0,0,0,0,0,0,0,0,0,0,0,0,0,0,0,0,0]
[0,0,0,0,0,0,0,0,0,0,0,0,0,0,0,0,0,0,0,0,0,0,0,0,0]
[0,0,0,0,0,0,0,0,0,0,0,0,0,0,0,0,0,0,0,0,0,0,0,0,0]
[0,0,0,0,0,0,0,0,0,0,0,0,0,0,0,0,0,0,0,0,0,0,0,0,0]
[0,0,0,0,0,0,0,0,0,0,0,0,0,0,0,0,0,0,0,0,0,0,0,0,0]
[0,0,0,0,0,0,0,0,0,0,0,0,0,0,0,0,0,0,0,0,0,0,0,0,0]
[0,0,0,0,0,0,0,0,0,0,0,0,0,0,0,0,0,0,0,0,0,0,0,0,0]
[0,0,0,0,0,0,0,0,0,0,0,0,0,0,0,0,0,0,0,0,0,0,0,0,0]
[0,0,0,0,0,0,0,0,0,0,0,0,0,0,0,0,0,0,0,0,0,0,0,0,0]
[0,0,0,0,0,0,0,0,0,0,0,0,0,0,0,0,0,0,0,0,0,0,0,0,0]
[0,0,0,0,0,0,0,0,0,0,0,0,0,0,0,0,0,0,0,0,0,0,0,0,0]
[0,0,0,0,0,0,0,0,0,0,0,0,0,0,0,0,0,0,0,0,0,0,0,0,0]
[0,0,0,0,0,0,0,0,0,0,0,0,0,0,0,0,0,0,0,0,0,0,0,0,0]
[0,0,0,0,0,0,0,0,0,0,0,0,0,0,0,0,0,0,0,0,0,0,0,0,0]
[0,0,0,0,0,0,0,0,0,0,0,0,0,0,0,0,0,0,0,0,0,0,0,0,0]
[0,0,0,0,0,0,0,0,0,0,0,0,0,0,0,0,0,0,0,0,0,0,0,0,0]
[0,0,0,0,0,0,0,0,0,0,0,0,0,0,0,0,0,0,0,0,0,0,0,0,0]
[0,0,0,0,0,0,0,0,0,0,0,0,0,0,0,0,0,0,0,0,0,0,0,0,0]
[0,0,0,0,0,0,0,0,0,0,0,0,0,0,0,0,0,0,0,0,0,0,0,0,0]

{"sheet":"calcPump","index":14,"n_rows":101,"n_cols":36,"rows_kept":101,"cut":false,"hidden":true,"merged":[[27,33,27,36],[21,33,21,36],[22,33,22,36],[23,33,23,36],[24,33,24,36],[25,33,25,36],[26,33,26,36],[16,33,16,36],[17,33,17,36],[18,33,18,36],[19,33,19,36],[20,33,20,36],[91,1,91,9],[91,10,91,12],[91,13,91,14],[92,1,92,9],[92,10,92,12],[92,13,92,14],[89,1,89,9],[89,10,89,12],[89,13,89,14],[90,1,90,9],[90,10,90,12],[90,13,90,14],[100,1,100,14],[101,1,101,14],[102,1,102,14],[103,1,103,14],[104,1,104,14],[105,1,105,14],[93,1,93,9],[93,10,93,12],[93,13,93,14],[94,1,94,9],[94,10,94,12],[94,13,94,14],[87,1,87,9],[87,10,87,12],[87,13,87,14],[88,1,88,9],[88,10,88,12],[88,13,88,14],[83,12,83,14],[83,15,83,17],[83,18,83,20],[83,21,83,23],[86,1,86,9],[86,10,86,12],[86,13,86,14],[81,12,81,14],[81,15,81,17],[81,18,81,20],[81,21,81,23],[82,12,82,14],[82,15,82,17],[82,18,82,20],[82,21,82,23],[79,12,79,14],[79,15,79,17],[79,18,79,20],[79,21,79,23],[80,12,80,14],[80,15,80,17],[80,18,80,20],[80,21,80,23],[77,1,77,3],[77,12,77,14],[77,15,77,17],[77,18,77,20],[77,21,77,23],[78,12,78,14],[78,15,78,17],[78,18,78,20],[78,21,78,23],[75,1,75,3],[75,12,75,14],[75,15,75,17],[75,18,75,20],[75,21,75,23],[76,1,76,3],[76,12,76,14],[76,15,76,17],[76,18,76,20],[76,21,76,23],[73,1,73,3],[73,12,73,14],[73,15,73,17],[73,18,73,20],[73,21,73,23],[74,1,74,3],[74,12,74,14],[74,15,74,17],[74,18,74,20],[74,21,74,23],[71,1,71,3],[71,12,71,14],[71,15,71,17],[71,18,71,20],[71,21,71,23],[72,1,72,3],[72,12,72,14],[72,15,72,17],[72,18,72,20],[72,21,72,23],[69,15,69,17],[69,18,69,20],[69,21,69,23],[70,1,70,3],[70,12,70,14],[70,15,70,17],[70,18,70,20],[70,21,70,23],[63,4,63,10],[63,11,63,12],[67,8,67,11],[68,1,68,3],[69,1,69,3],[69,12,69,14],[60,4,60,10],[60,11,60,12],[61,4,61,10],[61,11,61,12],[62,4,62,10],[62,11,62,12],[55,23,55,25],[55,26,55,28],[55,29,55,31],[55,32,55,34],[56,9,56,12],[59,4,59,10],[59,11,59,12],[54,29,54,31],[54,32,54,34],[54,35,54,37],[55,2,55,3],[55,4,55,6],[55,7,55,8],[55,9,55,12],[55,13,55,15],[55,16,55,19],[55,20,55,22],[54,2,54,3],[54,4,54,6],[54,7,54,8],[54,9,54,12],[54,13,54,15],[54,16,54,19],[54,20,54,22],[54,23,54,25],[54,26,54,28],[52,29,52,31],[52,32,52,34],[52,35,52,37],[53,2,53,3],[53,4,53,6],[53,7,53,8],[53,9,53,12],[53,13,53,15],[53,35,53,37],[53,16,53,19],[53,20,53,22],[53,23,53,25],[53,26,53,28],[53,29,53,31],[53,32,53,34],[52,2,52,3],[52,4,52,6],[52,7,52,8],[52,9,52,12],[52,13,52,15],[52,16,52,19],[52,20,52,22],[52,23,52,25],[52,26,52,28],[50,2,50,3],[50,4,50,6],[50,7,50,8],[50,9,50,12],[50,13,50,15],[50,35,50,37],[51,2,51,3],[51,4,51,6],[51,7,51,8],[51,9,51,12],[51,13,51,15],[51,16,51,19],[51,20,51,22],[51,23,51,25],[51,26,51,28],[50,16,50,19],[50,20,50,22],[50,23,50,25],[50,26,50,28],[50,29,50,31],[50,32,50,34],[51,29,51,31],[51,32,51,34],[51,35,51,37],[48,29,48,31],[48,32,48,34],[48,35,48,37],[49,2,49,3],[49,4,49,6],[49,7,49,8],[49,9,49,12],[49,13,49,15],[49,16,49,19],[49,20,49,22],[49,23,49,25],[49,26,49,28],[49,29,49,31],[49,32,49,34],[49,35,49,37],[48,2,48,3],[48,4,48,6],[48,7,48,8],[48,9,48,12],[48,13,48,15],[48,16,48,19],[48,20,48,22],[48,23,48,25],[48,26,48,28],[46,29,46,31],[46,32,46,34],[46,35,46,37],[47,2,47,3],[47,4,47,6],[47,7,47,8],[47,9,47,12],[47,13,47,15],[47,35,47,37],[47,16,47,19],[47,20,47,22],[47,23,47,25],[47,26,47,28],[47,29,47,31],[47,32,47,34],[46,2,46,3],[46,4,46,6],[46,7,46,8],[46,9,46,12],[46,13,46,15],[46,16,46,19],[46,20,46,22],[46,23,46,25],[46,26,46,28],[44,2,44,3],[44,4,44,6],[44,7,44,8],[44,9,44,12],[44,13,44,15],[44,35,44,37],[45,2,45,3],[45,4,45,6],[45,7,45,8],[45,9,45,12],[45,13,45,15],[45,16,45,19],[45,20,45,22],[45,23,45,25],[45,26,45,28],[44,16,44,19],[44,20,44,22],[44,23,44,25],[44,26,44,28],[44,29,44,31],[44,32,44,34],[45,29,45,31],[45,32,45,34],[45,35,45,37],[42,29,42,31],[42,32,42,34],[42,35,42,37],[43,2,43,3],[43,4,43,6],[43,7,43,8],[43,9,43,12],[43,13,43,15],[43,16,43,19],[43,20,43,22],[43,26,43,28],[43,29,43,31],[43,32,43,34],[42,2,42,3],[42,4,42,6],[42,7,42,8],[42,9,42,12],[42,13,42,15],[42,16,42,19],[42,20,42,22],[42,23,42,25],[42,26,42,28],[40,35,40,37],[41,2,41,3],[41,4,41,6],[41,7,41,8],[41,9,41,12],[41,13,41,15],[41,16,41,19],[41,20,41,22],[41,23,41,25],[41,26,41,28],[40,16,40,19],[40,20,40,22],[40,23,40,25],[40,26,40,28],[40,29,40,31],[40,32,40,34],[41,29,41,31],[41,32,41,34],[41,35,41,37],[37,2,37,6],[37,7,37,10],[39,9,39,12],[39,13,39,15],[39,16,39,19],[40,2,40,3],[40,4,40,6],[40,7,40,8],[40,9,40,12],[40,13,40,15],[34,2,34,6],[34,7,34,10],[35,2,35,6],[35,7,35,10],[36,2,36,6],[36,7,36,10],[30,2,30,7],[30,8,30,10],[30,11,30,12],[30,13,30,14],[32,2,32,6],[33,2,33,6],[33,7,33,10],[28,30,28,32],[29,2,29,7],[29,8,29,10],[29,11,29,12],[29,13,29,14],[29,26,29,29],[28,2,28,7],[28,8,28,10],[28,11,28,12],[28,13,28,14],[28,22,28,25],[28,26,28,29],[27,2,27,7],[27,8,27,10],[27,11,27,12],[27,13,27,14],[27,22,27,25],[27,26,27,29],[26,2,26,7],[26,8,26,10],[26,11,26,12],[26,13,26,14],[26,22,26,25],[26,26,26,29],[25,2,25,7],[25,8,25,10],[25,11,25,12],[25,13,25,14],[25,22,25,25],[25,26,25,29],[24,2,24,7],[24,8,24,10],[24,11,24,12],[24,13,24,14],[24,22,24,25],[24,26,24,29],[23,2,23,7],[23,8,23,10],[23,11,23,12],[23,13,23,14],[23,22,23,25],[23,26,23,29],[22,2,22,7],[22,8,22,10],[22,11,22,12],[22,13,22,14],[22,22,22,25],[22,26,22,29],[21,2,21,7],[21,8,21,10],[21,11,21,12],[21,13,21,14],[21,22,21,25],[21,26,21,29],[18,22,18,25],[18,26,18,29],[19,22,19,25],[19,26,19,29],[20,2,20,7],[20,8,20,10],[20,11,20,12],[20,13,20,14],[20,22,20,25],[20,26,20,29],[16,1,16,9],[16,10,16,12],[16,13,16,14],[16,15,16,16],[16,17,16,18],[16,22,16,25],[16,26,16,29],[17,1,17,9],[17,10,17,12],[17,13,17,14],[17,15,17,16],[17,17,17,18],[17,22,17,25],[17,26,17,29],[14,1,14,9],[14,10,14,12],[14,13,14,14],[14,15,14,16],[14,17,14,18],[15,1,15,9],[15,10,15,12],[15,13,15,14],[15,15,15,16],[15,17,15,18],[12,1,12,9],[12,10,12,12],[12,13,12,14],[12,15,12,16],[12,17,12,18],[13,1,13,9],[13,10,13,12],[13,13,13,14],[13,15,13,16],[13,17,13,18],[10,34,10,37],[11,1,11,9],[11,10,11,12],[11,13,11,14],[11,15,11,16],[11,17,11,18],[11,20,11,27],[11,28,11,29],[11,30,11,31],[11,32,11,33],[11,34,11,37],[10,1,10,9],[10,10,10,12],[10,13,10,14],[10,15,10,16],[10,17,10,18],[10,20,10,27],[10,28,10,29],[10,30,10,31],[10,32,10,33],[0,1,0,2],[1,1,1,15],[8,28,8,29],[8,30,8,31],[8,32,8,33],[8,34,8,37],[9,1,9,9],[9,10,9,12],[9,13,9,14],[9,15,9,16],[9,17,9,18],[9,20,9,27],[8,1,8,9],[8,10,8,12],[8,13,8,14],[8,15,8,16],[8,17,8,18],[8,20,8,27],[9,28,9,29],[9,30,9,31],[9,32,9,33],[9,34,9,37]]}
[null,"ABB",null,null,null,null,null,null,null,null,null,null,null,null,"ENERGY SAVINGS OF A PUMP DRIVE"]
[null,"Frequency Converter Control compared with Traditional Control methods"]
[null,null,null,null,null,null,null,null,null,null,null,null,null,null,null,"On/Off säätö"]
[null,null,null,null,null,null,null,null,null,null,null,null,null,null,null,"Jättämäsäätö"]
[]
[]
[]
[null,"INPUT DATA",null,null,null,null,null,null,null,null,null,null,null,null,null,null,null,null,null,null,"INITIAL DATA"]
[null,"Liquid density (water = 1)",null,null,null,null,null,null,null,null,"r (kg/dm³)",null,null,1,null,{"$f":"IF(0.5>N9,\"wrong\",IF(N9>2,\"wrong\",\"OK\"))","v":"OK"},null,null,null,null,"Transmission efficiency",null,null,null,null,null,null,null,"nt (%)",null,1,null,{"$f":"IF(AE9>1,\"wrong\",\"OK\")","v":"OK"},null,"Type 100 if not used"]
[null,"Pump nominal flow (1 l/s = 3,6 m3/h)",null,null,null,null,null,null,null,null,"Qn (m³/h)",null,null,1100,null,{"$f":"N10/3.6","v":305.55555555555554},null,{"$f":"\"=\"&INT(N10/3.6+0.5)&\" l/s\"","v":"=306 l/s"},null,null,"Head over open throttle valve",null,null,null,null,null,null,null,"Hv (m)",null,{"$f":"P34","v":0},null,{"$f":"IF(0>AE10,\"wrong\",IF(AE10>6,\"wrong\",\"OK\"))","v":"OK"}]
[null,"Nominal head of the pump",null,null,null,null,null,null,null,null,"Hn (m)",null,null,33,null,null,null,null,null,null,"Rated power of motor",null,null,null,null,null,null,null,"P1 (kW)",null,null,null,{"$f":"IF(AE11<1.1*$K$89,\"Wrong !\",\"OK\")","v":"Wrong !"},null,{"$f":"ROUND(1.1*$K$89,1)&\" kW\"","v":"123.6 kW"}]
[null,"Pump maximum head (at zero flow)",null,null,null,null,null,null,null,null,"Hmax (m)",null,null,44,null,{"$f":"IF(N12>N11,\"OK\",\"wrong\")","v":"OK"},null,null,null,null,"Nominal efficiency of frequency converter",null,null,null,null,null,null,null,"hvsd (%)",null,0.97499999999999998,null,{"$f":"IF(AE12>100,\"wrong\",\"OK\")","v":"OK"}]
[null,"Static head of the system ",null,null,null,null,null,null,null,null,"Hst (m) ",null,null,1,null,{"$f":"IF(N13<N11,\"OK\",\"wrong\")","v":"OK"}]
[null,"Nominal efficiency of the pump ",null,null,null,null,null,null,null,null,"hp (%)",null,null,0.88,null,{"$f":"IF(N14>1,\"wrong\",\"OK\")","v":"OK"}]
[null,"Supply and Motor voltage (400, 500, 690V)",null,null,null,null,null,null,null,null,"U (V)",null,null,400,null,{"$f":"IF(N15=400,\"OK\",IF(N15=500,\"OK\",IF(N15=690,\"OK\",\"wrong\")))","v":"OK"}]
[null,"Nominal efficiency of the motor",null,null,null,null,null,null,null,null,"hm (%)",null,null,0.95,null,{"$f":"IF(N16>100,\"wrong\",\"OK\")","v":"OK"},null,null,null,null,null,null,"Energy used per year [kWh]",null,null,null,null,null,null,null,null,null,null,"AC Drive ",null,"control"]
[null,"Total operating time per year",null,null,null,null,null,null,null,null,"Tk (h)",null,null,8760,null,{"$f":"IF(N17>8760,\"wrong\",\"OK\")","v":"OK"},null,null,null,null,null,null,"VSD",null,null,null,{"$f":"IF(ISERROR(AH18)=TRUE,\"-\",AH18)","v":"Throttling control"},null,null,null,null,null,null,"SELECTED CTRL"]
[null,"Price of energy (per kWh)",null,null,null,null,null,null,null,null,"EUR",null,null,0.1,null,null,null,null,null,null,null,null,"control",null,null,null,"control",null,null,null,null,null,null,{"$f":"HLOOKUP(B$34,J$40:Q$44,5)","v":"Throttling control"}]
[null,null,null,null,null,null,null,null,null,null,null,null,null,null,null,null,null,null,null,null,null,null,{"$f":"U47*$L22/100*$N$17","v":0},null,null,null,{"$f":"AH20*$L22*$N$17/100","v":0},null,null,null,null,null,null,"P [kW]"]
[null,"FLOW",null,null,null,null,null,null,null,null,null,null,null,null,null,null,null,null,null,null,null,null,2413.8660634972216,null,null,null,34286.917433319075,null,null,null,null,null,null,{"$f":"HLOOKUP(B$34,J$40:Q$55,I76)","v":73.876096491228083}]
[null,0.1,null,null,null,null,null,null,"Flow    m3/h",null,null,"Time (%)",null,"Hours",null,"Kuristussäätö","On/Off säätö","Jättämäsäätö",null,null,null,null,9505.2148119096491,null,null,null,72662.973222530025,null,null,null,null,null,null,78.280633409404288]
[null,{"$f":"B21+0.1","v":0.2},null,null,null,null,null,null,{"$f":"\"20%     \"&0.2*$N$10","v":"20%     220"},null,null,0,null,{"$f":"\"%= \"&$L$22*$N$17/100","v":"%= 0"},null,null,null,null,null,null,null,null,25099.185381764913,null,null,null,115563.32236842107,null,null,null,null,null,null,82.948599569098207]
[null,0.30000000000000004,null,null,null,null,null,null,{"$f":"\"30%     \"&0.3*$N$10","v":"30%     330"},null,null,5,null,{"$f":"\"%= \"&$L$23*$N$17/100","v":"%= 438"},null,null,null,null,null,null,null,null,53924.368206583145,null,null,null,163586.30299707604,null,null,null,null,null,null,87.947733918128677]
[null,0.4,"Operating time",null,null,null,null,null,{"$f":"\"40%     \"&0.4*$N$10","v":"40%     440"},null,null,10,null,{"$f":"\"%= \"&$L$24*$N$17/100","v":"%= 876"},null,null,null,null,null,null,null,null,80533.235443102778,null,null,null,174062.27313974596,null,null,null,null,null,null,93.371177509746587]
[null,0.5,"in different flow rates",null,null,null,null,null,{"$f":"\"50%     \"&0.5*$N$10","v":"50%     550"},null,null,15,null,{"$f":"\"%= \"&$L$25*$N$17/100","v":"%= 1314"},null,null,null,null,null,null,null,null,86620.29638004188,null,null,null,139387.14574898791,null,null,null,null,null,null,99.350612522686063]
[null,0.6,"as a percentage of the",null,null,null,null,null,{"$f":"\"60%     \"&0.6*$N$10","v":"60%     660"},null,null,20,null,{"$f":"\"%= \"&$L$26*$N$17/100","v":"%= 1752"},null,null,null,null,null,null,null,null,79579.502190976331,null,null,null,99092.31315789478,null,null,null,null,null,null,106.07849752586598]
[null,0.7,"total operating time",null,null,null,null,null,{"$f":"\"70%     \"&0.7*$N$10","v":"70%     770"},null,null,20,null,{"$f":"\"%= \"&$L$27*$N$17/100","v":"%= 1752"},null,null,null,null,null,null,null,null,53099.86504723347,null,null,null,51772.368421052626,null,null,null,null,null,null,113.11907894736846]
[null,0.79999999999999993,null,null,null,null,null,null,{"$f":"\"80%     \"&0.8*$N$10","v":"80%     880"},null,null,15,null,{"$f":"\"%= \"&$L$28*$N$17/100","v":"%= 1314"},null,null,null,null,null,null,null,null,"Frequency conv.",null,null,null,"Throttling control",null,null,null,null,null,null,118.20175438596492]
[null,0.89999999999999991,null,null,null,null,null,null,{"$f":"\"90%     \"&0.9*$N$10","v":"90%     990"},null,null,10,null,{"$f":"\"%= \"&$L$29*$N$17/100","v":"%= 876"},null,null,null,null,null,null,null,null,{"$f":"IF(ISERROR(SUM(W19:W27)),0,SUM(W19:W27))","v":390775.53352510941},null,null,null,{"$f":"IF(ISERROR(SUM(AA19:AA27)),0,SUM(AA19:AA27))","v":850413.61648902739},null,null,null,{"$f":"W29","v":390775.53352510941}]
[null,0.99999999999999989,null,null,null,null,null,null,{"$f":"\"100%   \"&1*$N$10","v":"100%   1100"},null,null,5,null,{"$f":"\"%= \"&$L$30*$N$17/100","v":"%= 438"},null,null,null,null,null,null,null,null,null,null,null,null,{"$f":"IF(ISERROR(AA29-W29)=TRUE,0,AA29-W29)","v":459638.08296391799}]
[null,null,"The sum must be = 100 %",null,null,null,null,null,"Sum",null,null,{"$f":"SUM(L23:M30)","v":100},null,{"$f":"IF(L31=100,\"OK\",\"wrong\")","v":"OK"}]
[]
[null,null,"Existing Control mthd"]
[null,1,1,null,null,null,null,"Throttling control",null,null,null,null,null,null,null,0,{"$f":"\"m\"","v":"m"}]
[null,null,2,null,null,null,null,"On/off control"]
[null,null,3,null,null,null,null,"Hydraulic control"]
[]
[]
[]
[null,null,null,null,null,null,null,null,null,1,null,null,null,2,null,null,3]
[null,null,"Qi",null,"Hpi",null,null,"Hsi",null,"Pthi",null,null,null,null,null,null,null,null,null,null,"Pvsdi",null,null,null,null,null,"Corr. factor",null,null,"Corr. factor",null,null,"Corr. factor"]
[null,null," = Qn * x%",null," = Hmax-(Qi/Qn)^2*(Hmax-Hn)",null,null," = Hst+(Qi/Qn)^2*(Hn-Hv-Hst)",null," = D*Qi*Hpi*9810/360*np*kpi*nm",null,null,null,null,null,null,null,null,null,null," = D*Qi*Hsi*9810/3,6*np*nm*nvsd*kmi*kvsd)",null,null,null,null,null,"kmi",null,null,"kvsdi",null,null,"kpi"]
[null,"%","Flow",null,"H (m)",null,null,"H (m)",null,"Power (kW)",null,null,null,"P",null,null,"Power (kW)",null,null,null,"Power (kW)",null,null,"Power (kW)",null,null,"of motor's ",null,null,"of drive's ",null,null,"of pump's",null,null,"Transmission"]
[null,null,"(m3/h)",null,"Pump",null,null,"System",null,"Throttling control",null,null,null,"On/off control",null,null,"Hydraulic control",null,null,null,"Speed contrl.",null,null,"Savings",null,null,"efficiency",null,null,"efficiency",null,null,"efficiency",null,null,"efficiency"]
[null,null,0,null,{"$f":"$N$12-($C$45/$N$10)^2*($N$12-$N$11)","v":44},null,null,{"$f":"$N$13+($C45/$N$10)^2*($N$11-$N$13-$AE$10)","v":1}]
[null,null,{"$f":"0.1*$N$10","v":110},null,{"$f":"$N$12-($C$46/$N$10)^2*($N$12-$N$11)","v":43.89},null,null,1.32]
[null,20,{"$f":"0.2*$N$10","v":220},null,{"$f":"$N$12-($C$47/$N$10)^2*($N$12-$N$11)","v":43.56},null,null,2.2800000000000002,null,{"$f":"($N$9*$C47*$E47*9.8)/(3600*$AG47*$N$14*$N$16)","v":73.876096491228083},null,null,null,{"$f":"($N$9*C47*$H$55*9.81)/(3600*$N$14*$N$16)","v":23.664473684210527},null,null,{"$f":"($N$9*C47*H47*9.8)/(3600*$N$14*$N$16*1*AJ47)","v":5.4744139098562208},null,null,null,{"$f":"($N$9*C47*H47*9.8)/(3600*$N$14*$N$16*$AE$12*$AA47*$AD47)","v":2.3596972932482774},null,null,{"$f":"J47-U47","v":71.516399197979808},null,null,{"$f":"(C47/$N$10)^(0.2-0.2*$N$13/$N$11)","v":0.73188387865607007},null,null,0.97,null,null,{"$f":"$C47*(2.4-1.44*$C47/$C$55)/$C$55","v":0.42240000000000005},null,null,{"$f":"0.98*(0.2+(0.8*0.75*($N$13/$N$11)^0.5))","v":0.29835766170195038}]
[null,30,{"$f":"0.3*$N$10","v":330},null,{"$f":"$N$12-($C$48/$N$10)^2*($N$12-$N$11)","v":43.01},null,null,3.88,null,78.280633409404288,null,null,null,35.496710526315795,null,null,10.869919011342686,null,null,null,5.5111097340119217,null,null,72.769523675392364,null,null,0.79175937245381967,null,null,0.98,null,null,0.59039999999999992,null,null,{"$f":"0.98*(0.3+(0.7*0.75*($N$13/$N$11)^0.5))","v":0.38356295398920648}]
[null,40,{"$f":"0.4*$N$10","v":440},null,{"$f":"$N$12-($C$49/$N$10)^2*($N$12-$N$11)","v":42.24},null,null,6.120000000000001,null,82.948599569098207,null,null,null,47.328947368421055,null,null,18.705236803647065,null,null,null,10.850701840079507,null,null,72.097897729018698,null,null,0.83718946741910039,null,null,0.99,null,null,0.72959999999999992,null,null,{"$f":"0.98*(0.4+(0.6*0.75*($N$13/$N$11)^0.5))","v":0.46876824627646274}]
[null,50,{"$f":"0.5*$N$10","v":550},null,{"$f":"$N$12-($C$50/$N$10)^2*($N$12-$N$11)","v":41.25},null,null,9,null,87.947733918128677,null,null,null,59.161184210526315,null,null,29.096012590098852,null,null,null,19.101358738025048,null,null,68.846375180103621,null,null,0.87421534448149729,null,null,0.99,null,null,0.84,null,null,{"$f":"0.98*(0.5+(0.5*0.75*($N$13/$N$11)^0.5))","v":0.553973538563719}]
[null,60,{"$f":"0.6*$N$10","v":660},null,{"$f":"$N$12-($C$51/$N$10)^2*($N$12-$N$11)","v":40.04},null,null,12.52,null,93.371177509746587,null,null,null,70.993421052631589,null,null,42.096227605092629,null,null,null,30.778748976360244,null,null,62.592428533386339,null,null,0.90568002203555142,null,null,0.99,null,null,0.92159999999999997,null,null,{"$f":"0.98*(0.6+(0.4*0.75*($N$13/$N$11)^0.5))","v":0.63917883085097515}]
[null,70,{"$f":"0.7*$N$10","v":770},null,{"$f":"$N$12-($C$52/$N$10)^2*($N$12-$N$11)","v":38.61},null,null,16.68,null,99.350612522686063,null,null,null,82.82565789473685,null,null,57.73446502855046,null,null,null,45.966458586245878,null,null,53.384153936440185,null,null,0.93316492761931047,null,null,1,null,null,0.97439999999999993,null,null,{"$f":"0.98*(0.7+(0.3*0.75*($N$13/$N$11)^0.5))","v":0.72438412313823142}]
[null,80,{"$f":"0.8*$N$10","v":880},null,{"$f":"$N$12-($C$53/$N$10)^2*($N$12-$N$11)","v":36.96},null,null,21.480000000000004,null,106.07849752586598,null,null,null,94.65789473684211,null,null,76.027275085647972,null,null,null,65.921077914795958,null,null,40.157419611070026,null,null,0.95764673167072223,null,null,1,null,null,0.99839999999999984,null,null,{"$f":"0.98*(0.8+(0.2*0.75*($N$13/$N$11)^0.5))","v":0.80958941542548757}]
[null,90,{"$f":"0.9*$N$10","v":990},null,{"$f":"$N$12-($C$54/$N$10)^2*($N$12-$N$11)","v":35.090000000000003},null,null,26.92,null,113.11907894736846,null,null,null,106.49013157894737,null,null,96.984904134265349,null,null,null,90.844180583306326,null,null,22.274898364062139,null,null,0.97977379582069379,null,null,1,null,null,1,null,null,{"$f":"0.98*(0.9+(0.1*0.75*($N$13/$N$11)^0.5))","v":0.89479470771274383}]
[null,100,{"$f":"1*$N$10","v":1100},null,{"$f":"$N$12-($C$55/$N$10)^2*($N$12-$N$11)","v":33},null,null,33,null,118.20175438596492,null,null,null,118.32236842105263,null,null,120.6140350877193,null,null,null,121.23256860098967,null,null,-3.0308142150247477,null,null,1,null,null,1,null,null,1,null,null,0.98]
[]
[null,null,null,null,null,null,null,null,null,5]
[]
[]
[null,null,null,null,"Nom. product of a pump [m3/y]",null,null,null,null,null,null,{"$f":"N17*N10","v":9636000},null,null,null,null,null,null,null,null,"Tham chiếu:-any reference text "]
[null,null,null,null,"Duty time -% of a year",null,null,null,null,null,null,{"$f":"N56/L60","v":0},null,null,null,null,null,null,null,null,"Lưu lượng danh định-1100"]
[null,null,null,null,"Run time hours/year",null,null,null,null,null,null,{"$f":"L61*N17","v":0},null,null,null,null,null,null,null,null,"Điều khiển được cải tiến cho-ACS550-01-246A-4"]
[null,null,null,null,"ON/OFF run time energy [kWh]",null,null,null,null,null,null,{"$f":"L62*K89/N16","v":0},null,null,null,null,null,null,null,null,"Tiết kiệm năng lượng/ năm"]
[null,null,null,null,"rectified:",null,null,null,null,null,null,{"$f":"IF(ISERROR(L63),0,L63)","v":0},null,null,null,null,null,null,null,null,460]
[]
[]
[]
[null,null,null,null,null,null,null,null,"FOR HLOOKUP J"]
[null,"FLOW (m³/h)",null,null,null,null,null,null,1]
[null,{"$f":"C55","v":1100},null,null,5,null,null,null,{"$f":"I69+1","v":2},null,null,null,null,null,null,"Throttle",null,null,"Drive",null,null,"Hydraulic"]
[null,{"$f":"C54","v":990},null,null,10,null,null,null,3,null,null,null,"Flow",null,null,"Power",null,null,"Power",null,null,"Power"]
[null,{"$f":"C53","v":880},null,null,15,null,null,null,4,null,null,null,"Flow (m³/h)",null,null,"Power (kW)"]
[null,{"$f":"C52","v":770},null,null,20,null,null,null,5]
[null,{"$f":"C51","v":660},null,null,20,null,null,null,6,null,null,null,{"$f":"C45","v":0}]
[null,{"$f":"C50","v":550},null,null,15,null,null,null,7,null,null,null,110]
[null,{"$f":"C49","v":440},null,null,10,null,null,null,8,null,null,null,220,null,null,{"$f":"J47","v":73.876096491228083},null,null,{"$f":"U47","v":2.3596972932482774},null,null,{"$f":"Q47","v":5.4744139098562208}]
[null,{"$f":"C48","v":330},null,null,5,null,null,null,9,null,null,null,330,null,null,78.280633409404288,null,null,5.5111097340119217,null,null,10.869919011342686]
[null,{"$f":"C47","v":220},null,null,0,null,null,null,10,null,null,null,440,null,null,82.948599569098207,null,null,10.850701840079507,null,null,18.705236803647065]
[null,null,null,null,null,null,null,null,11,null,null,null,550,null,null,87.947733918128677,null,null,19.101358738025048,null,null,29.096012590098852]
[null,null,null,null,null,null,null,null,12,null,null,null,660,null,null,93.371177509746587,null,null,30.778748976360244,null,null,42.096227605092629]
[null,null,null,null,null,null,null,null,13,null,null,null,770,null,null,99.350612522686063,null,null,45.966458586245878,null,null,57.73446502855046]
[null,null,null,null,null,null,null,null,14,null,null,null,880,null,null,106.07849752586598,null,null,65.921077914795958,null,null,76.027275085647972]
[null,null,null,null,null,null,null,null,15,null,null,null,990,null,null,113.11907894736846,null,null,90.844180583306326,null,null,96.984904134265349]
[null,null,null,null,null,null,null,null,16,null,null,null,1100,null,null,118.20175438596492,null,null,121.23256860098967,null,null,120.6140350877193]
[]
[]
[null,"RESULTS OF CALCULATIONS:"]
[null,"Recommended Drive type:"]
[null,"Calculated power demand of a pump",null,null,null,null,null,null,null,null,{"$f":"($N$9*$N$10*$N$11*9.81)/(3600*$N$14*$AE$9)","v":112.40625},null,null,"kW"]
[null,"Calculated energy / throttling",null,null,null,null,null,null,null,null,{"$f":"$AA$29","v":850413.61648902739},null,null,"kWh"]
[null,"Calculated energy / freq. converter control",null,null,null,null,null,null,null,null,{"$f":"$W$29","v":390775.53352510941},null,null,"kWh"]
[null,"Total energy savings / year",null,null,null,null,null,null,null,null,{"$f":"$K$90-$K$91","v":459638.08296391799},null,null,"kWh"]
[null,"Total energy cost savings / year ",null,null,null,null,null,null,null,null,{"$f":"$N$18*$K$92","v":45963.808296391799},null,null,{"$f":"K18","v":"EUR"}]
[null,"Investment costs (can be given)",null,null,null,null,null,null,null,null,7000,null,null,{"$f":"K18","v":"EUR"}]
[null,"Direct payback time",null,null,null,null,null,null,null,null,{"$f":"K94/K93","v":0.15229373412362585},null,null,"Years"]
[]
[]
[]
[]
[]
[null,"COMMENTS:"]

{"sheet":"Settings","index":15,"n_rows":31,"n_cols":5,"rows_kept":31,"cut":false,"hidden":true,"merged":[]}
["Field or component","Minimum value","Maximum value","Content or default value","Value Entered"]
[]
["Input_NominalFlow",0,9999999,1100,1100]
["Input_NominalHead",0,4000,33,33]
["Input_MaxHead",0,5000,44,44]
["Input_Efficiency",0,100,88,88]
["Input_Liquid",0,8000,1000,1000]
["Label_StaticHead",0]
["Input_StaticHead",0,{"$f":"C4","v":4000},1,1]
["Value_Required",null,124]
["Input_MotorPower",0,{"$f":"8*C10","v":992},null,132]
["Input_MotorEfficiency",0,100,95,95]
["Input_AnnualRunningTime",20,8784,8760,8760]
["Input_100",0,100,5,5]
["Input_90",0,100,10,10]
["Input_80",0,100,15,15]
["Input_70",0,100,20,20]
["Input_60",0,100,20,20]
["Input_50",0,100,15,15]
["Input_40",0,100,10,10]
["Input_30",0,100,5,5]
["Input_20",0,100,0,0]
["Input_EnergyPrice",0,9999999,0.1,"0,1"]
["Input_InvCost",0,9999999,7000,7000]
["Input_InterestRate",0,100,4,4]
["Input_CO2Emission",0,10,0.5,"0,5"]
["ComboBox_ExistingFlowCtrl",null,null,null,"Throttling control"]
["ComboBox_SupplyVoltage",null,null,null," 400 V"]
["ComboBox_Improved",null,null,null,"ACS550"]
["ComboBox_CurrencyUnit",null,null,null,"€"]
["ComboBox_Language",null,null,"English","English"]