{"text_format":"1","workbook":"xlsx","n_sheets":16,"sheets":["Application","ACS580","ACS550","DriveSel","TypeListTemplate","ACS55","ACS150","ACS310","ACS355","Language","ACS800","ACS880","ACQ810","StdDrives","calcPump","Settings"],"not_rendered":{"charts":4,"images":56,"macros":1,"external_links":1,"defined_names":113,"comments":14,"pivot_tables":0},"unopened":[],"bounds":{"document_bytes":16777216,"sheet_cells":100000,"rows_first":2000,"rows_last":500,"rows_between":2000,"halvings":0,"cell_chars":16384,"cell_head_chars":4096},"cells_cut":0,"cells_raw":0,"read":"whole","date_system":"1900"}

{"sheet":"Application","index":0,"n_rows":0,"n_cols":0,"rows_kept":0,"cut":false,"hidden":false,"merged":[]}

{"sheet":"ACS580","index":1,"n_rows":95,"n_cols":17,"rows_kept":95,"cut":false,"hidden":true,"merged":[]}
["Typecode","Prod.class",null,"Voltage range 1",null,"Voltage range 2 (1-ph)",null,"Voltage range 2",null,"Voltage range 3",null,"Voltage range 4.6",null,"Voltage range 5",null,"Voltage range 7/6"]
[{"$f":"VLOOKUP(DriveSel!E20,C8:Y71,DriveSel!D18)","v":"ACS580-01-246A-4"},{"$f":"VLOOKUP(#REF!,C8:X70,7)","v":{"$error":"#REF!"}},"non-US (50Hz)"," 115 V (1-ph)",null," 230 V (1-ph)",null," 230 V (3-ph)",null," 400 V",null," 460 V",null," 500 V",null," 690 V"]
["Col.ordinal","Col.ordinal"]
[null,null,"Alternatives:","115 V 1-ph",null,"200/208/230/240 V 1-ph",null,"200/208/230/240 V 3-ph",null,"380/400/415 V",null,"440/460/480 V",null,"500 V",null,"525/550/575/600/660/690 V"]
["Motor Power","Motor",null,"Drive type",null,"Drive type",null,"Drive type",null,"Drive type",null,"Drive type",null,"Drive type",null,"Drive type"]
[{"$f":"TypeListTemplate!A6","v":"Hp"},{"$f":"TypeListTemplate!B6","v":"power kW"}]
{"$rows_left_out":90}
{"sheet":"ACS550","index":2,"n_rows":95,"n_cols":17,"rows_kept":95,"cut":false,"hidden":true,"merged":[]}
["Typecode","Prod.class",null,"Voltage range 1",null,"Voltage range 2 (1-ph)",null,"Voltage range 2",null,"Voltage range 3",null,"Voltage range 4.6",null,"Voltage range 5",null,"Voltage range 7/6"]
[{"$f":"VLOOKUP(DriveSel!E20,C8:Y71,DriveSel!D18)","v":"ACS550-01-246A-4"},{"$f":"VLOOKUP(#REF!,C8:X70,7)","v":{"$error":"#REF!"}},"non-US (50Hz)"," 115 V (1-ph)",null," 230 V (1-ph)",null," 230 V (3-ph)",null," 400 V",null," 460 V",null," 500 V",null," 690 V"]
["Col.ordinal","Col.ordinal"]
[null,null,"Alternatives:","115 V 1-ph",null,"200/208/230/240 V 1-ph",null,"200/208/230/240 V 3-ph",null,"380/400/415 V",null,"440/460/480 V",null,"500 V",null,"525/550/575/600/660/690 V"]
["Motor Power","Motor",null,"Drive type",null,"Drive type",null,"Drive type",null,"Drive type",null,"Drive type",null,"Drive type",null,"Drive type"]
[{"$f":"TypeListTemplate!A6","v":"Hp"},{"$f":"TypeListTemplate!B6","v":"power kW"}]
{"$rows_left_out":90}
{"sheet":"DriveSel","index":3,"n_rows":23,"n_cols":10,"rows_kept":23,"cut":false,"hidden":true,"merged":[]}
[null,"Motor and supply voltage",null,null,null,null,"Drive Product series",null,null,"non-US"]
[null,null,null,"Column Ordinate",null,null,0," - Pick the preferred product series! ->",null,{"$f":"IF(USUnits,FALSE,TRUE)","v":true}]
[null,0," - Select ->",0,null,null,1,"ACS55",{"$f":"H3","v":"ACS55"},{"$f":"'ACS55'!A$2","v":0}]
[null,{"$f":"B3+1","v":1}," 115 V (1-ph)",{"$f":"TypeListTemplate!D7","v":2},{"$f":"TypeListTemplate!D4","v":"115 V 1-ph"},null,2,"ACS150",{"$f":"H4","v":"ACS150"},{"$f":"'ACS150'!A$2","v":0}]
[null,{"$f":"B4+1","v":2}," 230 V (1-ph)",{"$f":"TypeListTemplate!F7","v":4},{"$f":"TypeListTemplate!F4","v":"200/208/230/240 V 1-ph"},null,3,"ACS310","ACS310",{"$f":"'ACS310'!A$2","v":0}]
[null,3," 230 V (3-ph)",{"$f":"TypeListTemplate!H7","v":6},{"$f":"TypeListTemplate!H4","v":"200/208/230/240 V 3-ph"},null,4,"ACS355",{"$f":"H6","v":"ACS355"},{"$f":"'ACS355'!A$2","v":0}]
{"$rows_left_out":18}
{"sheet":"TypeListTemplate","index":4,"n_rows":74,"n_cols":17,"rows_kept":74,"cut":false,"hidden":true,"merged":[]}
[null,null,null,"Voltage range 1",null,"Voltage range 2 (1-ph)",null,"Voltage range 2",null,"Voltage range 3",null,"Voltage range 4.6",null,"Voltage range 5",null,"Voltage range 7/6"]
[null,null,"non-US (50Hz)"," 115 V (1-ph)",null," 230 V (1-ph)",null," 230 V (3-ph)",null," 400 V",null," 460 V",null," 500 V",null," 690 V"]
["Col.ordinal","Col.ordinal"]
[null,null,"Alternatives:","115 V 1-ph",null,"200/208/230/240 V 1-ph",null,"200/208/230/240 V 3-ph",null,"380/400/415 V",null,"440/460/480 V",null,"500 V",null,"525/550/575/600/660/690 V"]
["Motor Power","Motor",null,"Drive type",null,"Drive type",null,"Drive type",null,"Drive type",null,"Drive type",null,"Drive type",null,"Drive type"]
["Hp","power kW"]
{"$rows_left_out":69}
{"sheet":"ACS55","index":5,"n_rows":95,"n_cols":17,"rows_kept":95,"cut":false,"hidden":true,"merged":[]}
["Typecode","Prod.class",null,"Voltage range 1",null,"Voltage range 2 (1-ph)",null,"Voltage range 2",null,"Voltage range 3",null,"Voltage range 4.6",null,"Voltage range 5",null,"Voltage range 7/6"]
[{"$f":"VLOOKUP(DriveSel!E20,C8:Y71,DriveSel!D18)","v":0},{"$f":"VLOOKUP(#REF!,C8:X70,7)","v":{"$error":"#REF!"}},"non-US (50Hz)"," 115 V (1-ph)",null," 230 V (1-ph)",null," 230 V (3-ph)",null," 400 V",null," 460 V",null," 500 V",null," 690 V"]
["Col.ordinal","Col.ordinal"]
[null,null,"Alternatives:","115 V 1-ph",null,"200/208/230/240 V 1-ph",null,"200/208/230/240 V 3-ph",null,"380/400/415 V",null,"440/460/480 V",null,"500 V",null,"525/550/575/600/660/690 V"]
[{"$f":"TypeListTemplate!A5","v":"Motor Power"},{"$f":"TypeListTemplate!B5","v":"Motor"},{"$f":"TypeListTemplate!C5","v":0},{"$f":"TypeListTemplate!D5","v":"Drive type"},{"$f":"TypeListTemplate!E5","v":0},{"$f":"TypeListTemplate!F5","v":"Drive type"},{"$f":"TypeListTemplate!G5","v":0},{"$f":"TypeListTemplate!H5","v":"Drive type"},{"$f":"TypeListTemplate!I5","v":0},{"$f":"TypeListTemplate!J5","v":"Drive type"},{"$f":"TypeListTemplate!K5","v":0},{"$f":"TypeListTemplate!L5","v":"Drive type"},{"$f":"TypeListTemplate!M5","v":0},{"$f":"TypeListTemplate!N5","v":"Drive type"},{"$f":"TypeListTemplate!O5","v":0},{"$f":"TypeListTemplate!P5","v":"Drive type"},{"$f":"TypeListTemplate!Q5","v":0}]
[{"$f":"TypeListTemplate!A6","v":"Hp"},{"$f":"TypeListTemplate!B6","v":"power kW"}]
{"$rows_left_out":90}
{"sheet":"ACS150","index":6,"n_rows":95,"n_cols":17,"rows_kept":95,"cut":false,"hidden":true,"merged":[]}
["Typecode","Prod.class",null,"Voltage range 1",null,"Voltage range 2 (1-ph)",null,"Voltage range 2",null,"Voltage range 3",null,"Voltage range 4.6",null,"Voltage range 5",null,"Voltage range 7/6"]
[{"$f":"VLOOKUP(DriveSel!E20,C8:Y71,DriveSel!D18)","v":0},{"$f":"VLOOKUP(#REF!,C8:X70,7)","v":{"$error":"#REF!"}},"non-US (50Hz)"," 115 V (1-ph)",null," 230 V (1-ph)",null," 230 V (3-ph)",null," 400 V",null," 460 V",null," 500 V",null," 690 V"]
["Col.ordinal","Col.ordinal"]
[null,null,"Alternatives:","115 V 1-ph",null,"200/208/230/240 V 1-ph",null,"200/208/230/240 V 3-ph",null,"380/400/415 V",null,"440/460/480 V",null,"500 V",null,"525/550/575/600/660/690 V"]
[{"$f":"TypeListTemplate!A5","v":"Motor Power"},{"$f":"TypeListTemplate!B5","v":"Motor"},{"$f":"TypeListTemplate!C5","v":0},{"$f":"TypeListTemplate!D5","v":"Drive type"},{"$f":"TypeListTemplate!E5","v":0},{"$f":"TypeListTemplate!F5","v":"Drive type"},{"$f":"TypeListTemplate!G5","v":0},{"$f":"TypeListTemplate!H5","v":"Drive type"},{"$f":"TypeListTemplate!I5","v":0},{"$f":"TypeListTemplate!J5","v":"Drive type"},{"$f":"TypeListTemplate!K5","v":0},{"$f":"TypeListTemplate!L5","v":"Drive type"},{"$f":"TypeListTemplate!M5","v":0},{"$f":"TypeListTemplate!N5","v":"Drive type"},{"$f":"TypeListTemplate!O5","v":0},{"$f":"TypeListTemplate!P5","v":"Drive type"},{"$f":"TypeListTemplate!Q5","v":0}]
[{"$f":"TypeListTemplate!A6","v":"Hp"},{"$f":"TypeListTemplate!B6","v":"power kW"}]
{"$rows_left_out":90}
{"sheet":"ACS310","index":7,"n_rows":94,"n_cols":17,"rows_kept":94,"cut":false,"hidden":true,"merged":[]}
["Typecode","Prod.class",null,"Voltage range 1",null,"Voltage range 2 (1-ph)",null,"Voltage range 2",null,"Voltage range 3",null,"Voltage range 4.6",null,"Voltage range 5",null,"Voltage range 7/6"]
[{"$f":"VLOOKUP(DriveSel!E20,C8:Y70,DriveSel!D18)","v":0},{"$f":"VLOOKUP(#REF!,C8:X69,7)","v":{"$error":"#REF!"}},"non-US (50Hz)"," 115 V (1-ph)",null," 230 V (1-ph)",null," 230 V (3-ph)",null," 400 V",null," 460 V",null," 500 V",null," 690 V"]
["Col.ordinal","Col.ordinal"]
[null,null,"Alternatives:","115 V 1-ph",null,"200/208/230/240 V 1-ph",null,"200/208/230/240 V 3-ph",null,"380/400/415 V",null,"440/460/480 V",null,"500 V",null,"525/550/575/600/660/690 V"]
[{"$f":"TypeListTemplate!A5","v":"Motor Power"},{"$f":"TypeListTemplate!B5","v":"Motor"},{"$f":"TypeListTemplate!C5","v":0},{"$f":"TypeListTemplate!D5","v":"Drive type"},{"$f":"TypeListTemplate!E5","v":0},{"$f":"TypeListTemplate!F5","v":"Drive type"},{"$f":"TypeListTemplate!G5","v":0},{"$f":"TypeListTemplate!H5","v":"Drive type"},{"$f":"TypeListTemplate!I5","v":0},{"$f":"TypeListTemplate!J5","v":"Drive type"},{"$f":"TypeListTemplate!K5","v":0},{"$f":"TypeListTemplate!L5","v":"Drive type"},{"$f":"TypeListTemplate!M5","v":0},{"$f":"TypeListTemplate!N5","v":"Drive type"},{"$f":"TypeListTemplate!O5","v":0},{"$f":"TypeListTemplate!P5","v":"Drive type"},{"$f":"TypeListTemplate!Q5","v":0}]
[{"$f":"TypeListTemplate!A6","v":"Hp"},{"$f":"TypeListTemplate!B6","v":"power kW"}]
{"$rows_left_out":89}
{"sheet":"ACS355","index":8,"n_rows":95,"n_cols":17,"rows_kept":95,"cut":false,"hidden":true,"merged":[]}
["Typecode","Prod.class",null,"Voltage range 1",null,"Voltage range 2 (1-ph)",null,"Voltage range 2",null,"Voltage range 3",null,"Voltage range 4.6",null,"Voltage range 5",null,"Voltage range 7/6"]
[{"$f":"VLOOKUP(DriveSel!E20,C8:Y71,DriveSel!D18)","v":0},{"$f":"VLOOKUP(#REF!,C8:X70,7)","v":{"$error":"#REF!"}},"non-US (50Hz)"," 115 V (1-ph)",null," 230 V (1-ph)",null," 230 V (3-ph)",null," 400 V",null," 460 V",null," 500 V",null," 690 V"]
["Col.ordinal","Col.ordinal"]
[null,null,"Alternatives:","115 V 1-ph",null,"200/208/230/240 V 1-ph",null,"200/208/230/240 V 3-ph",null,"380/400/415 V",null,"440/460/480 V",null,"500 V",null,"525/550/575/600/660/690 V"]
[{"$f":"TypeListTemplate!A5","v":"Motor Power"},{"$f":"TypeListTemplate!B5","v":"Motor"},{"$f":"TypeListTemplate!C5","v":0},{"$f":"TypeListTemplate!D5","v":"Drive type"},{"$f":"TypeListTemplate!E5","v":0},{"$f":"TypeListTemplate!F5","v":"Drive type"},{"$f":"TypeListTemplate!G5","v":0},{"$f":"TypeListTemplate!H5","v":"Drive type"},{"$f":"TypeListTemplate!I5","v":0},{"$f":"TypeListTemplate!J5","v":"Drive type"},{"$f":"TypeListTemplate!K5","v":0},{"$f":"TypeListTemplate!L5","v":"Drive type"},{"$f":"TypeListTemplate!M5","v":0},{"$f":"TypeListTemplate!N5","v":"Drive type"},{"$f":"TypeListTemplate!O5","v":0},{"$f":"TypeListTemplate!P5","v":"Drive type"},{"$f":"TypeListTemplate!Q5","v":0}]
[{"$f":"TypeListTemplate!A6","v":"Hp"},{"$f":"TypeListTemplate!B6","v":"power kW"}]
{"$rows_left_out":90}
{"sheet":"Language","index":9,"n_rows":111,"n_cols":10,"rows_kept":111,"cut":false,"hidden":true,"merged":[]}
["Field or component",null,null,"Content or default value"]
[null,"Chinese","Dutch","English","Finnish","French","German","Portuguese","Russian","Vietnamese"]
["Header_AppTitle","PumpSave 5.3","PumpSave 5.3","PumpSave 5.3","PumpSave 5.3","PumpSave 5.3","PumpSave 5.3","PumpSave 5.3","PumpSave 5.3","PumpSave 5.3"]
["Header_AppSubTitle","水泵节能计算工具","Calculatie energiebesparing voor pompen","Energy saving calculator for pumps","Energiansäästölaskuri pumpuille","Economies d'énergie pour pompes","Energiesparrechner für Pumpen","Cálculo de Economia de Energia","Расчет энергосбережения для насосов","Tính toán tiết kiệm năng lượng cho máy bơm"]
["Header_Pump","水泵","Pomp","Pump","Pumppu","Pompe","Pumpe","Bomba","насос","Máy bơm"]
["Label_NominalVolume","额定流量","Nominaal debiet","Nominal volume flow","Tilavuusvirta","Débit nominal","Nennvolumenstrom","Volume Fluxo nominal","Номинальный расход","Lưu lượng danh định"]
{"$rows_left_out":106}
{"sheet":"ACS800","index":10,"n_rows":95,"n_cols":17,"rows_kept":95,"cut":false,"hidden":true,"merged":[]}
["Typecode","Prod.class",null,"Voltage range 1",null,"Voltage range 2 (1-ph)",null,"Voltage range 2",null,"Voltage range 3",null,"Voltage range 4.6",null,"Voltage range 5",null,"Voltage range 7/6"]
[{"$f":"VLOOKUP(DriveSel!E20,C8:Y71,DriveSel!D18)","v":"ACS800-01-0165-3"},{"$f":"VLOOKUP(#REF!,C8:X70,7)","v":{"$error":"#REF!"}},"non-US (50Hz)"," 115 V (1-ph)",null," 230 V (1-ph)",null," 230 V (3-ph)",null," 400 V",null," 460 V",null," 500 V",null," 690 V"]
["Col.ordinal","Col.ordinal"]
[null,null,"Alternatives:","115 V 1-ph",null,"200/208/230/240 V 1-ph",null,"200/208/230/240 V 3-ph",null,"380/400/415 V",null,"440/460/480 V",null,"500 V",null,"525/550/575/600/660/690 V"]
["Motor Power","Motor",null,"Drive type",null,"Drive type",null,"Drive type",null,"Drive type",null,"Drive type",null,"Drive type",null,"Drive type"]
[{"$f":"TypeListTemplate!A6","v":"Hp"},{"$f":"TypeListTemplate!B6","v":"power kW"}]
{"$rows_left_out":90}
{"sheet":"ACS880","index":11,"n_rows":113,"n_cols":17,"rows_kept":113,"cut":false,"hidden":true,"merged":[]}
["Typecode","Prod.class",null,"Voltage range 1",null,"Voltage range 2 (1-ph)",null,"Voltage range 2",null,"Voltage range 3",null,"Voltage range 4.6",null,"Voltage range 5",null,"Voltage range 7/6"]
[{"$f":"VLOOKUP(DriveSel!E20,C8:Y71,DriveSel!D18)","v":"ACS880-01-246A-3"},{"$f":"VLOOKUP(#REF!,C8:X70,7)","v":{"$error":"#REF!"}},"non-US (50Hz)"," 115 V (1-ph)",null," 230 V (1-ph)",null," 230 V (3-ph)",null," 400 V",null," 460 V",null," 500 V",null," 690 V"]
["Col.ordinal","Col.ordinal","US (60Hz)"," 115 V (1-ph)",null," 230 V (1-ph)",null," 230 V (3-ph)",null," 400 V",null," 460 V",null," 500 V",null," 575 V"]
[null,null,"Alternatives:","115 V 1-ph",null,"200/208/230/240 V 1-ph",null,"200/208/230/240 V 3-ph",null,"380/400/415 V",null,"440/460/480 V",null,"500 V",null,"525/550/575/600/660/690 V"]
["Motor Power","Motor",null,"Drive type",null,"Drive type",null,"Drive type",null,"Drive type",null,"Drive type",null,"Drive type",null,"Drive type"]
["Hp","power kW"]
{"$rows_left_out":108}
{"sheet":"ACQ810","index":12,"n_rows":95,"n_cols":17,"rows_kept":95,"cut":false,"hidden":true,"merged":[]}
["Typecode","Prod.class",null,"Voltage range 1",null,"Voltage range 2 (1-ph)",null,"Voltage range 2",null,"Voltage range 3",null,"Voltage range 4.6",null,"Voltage range 5",null,"Voltage range 7/6"]
[{"$f":"VLOOKUP(DriveSel!E20,C8:Y71,DriveSel!D18)","v":"ACQ810-04-240A-4"},{"$f":"VLOOKUP(#REF!,C8:X70,7)","v":{"$error":"#REF!"}},"non-US (50Hz)"," 115 V (1-ph)",null," 230 V (1-ph)",null," 230 V (3-ph)",null," 400 V",null," 460 V",null," 500 V",null," 690 V"]
["Col.ordinal","Col.ordinal"]
[null,null,"Alternatives:","115 V 1-ph",null,"200/208/230/240 V 1-ph",null,"200/208/230/240 V 3-ph",null,"380/400/415 V",null,"440/460/480 V",null,"500 V",null,"525/550/575/600/660/690 V"]
[{"$f":"TypeListTemplate!A5","v":"Motor Power"},{"$f":"TypeListTemplate!B5","v":"Motor"},{"$f":"TypeListTemplate!C5","v":0},{"$f":"TypeListTemplate!D5","v":"Drive type"},{"$f":"TypeListTemplate!E5","v":0},{"$f":"TypeListTemplate!F5","v":"Drive type"},{"$f":"TypeListTemplate!G5","v":0},{"$f":"TypeListTemplate!H5","v":"Drive type"},{"$f":"TypeListTemplate!I5","v":0},{"$f":"TypeListTemplate!J5","v":"Drive type"},{"$f":"TypeListTemplate!K5","v":0},{"$f":"TypeListTemplate!L5","v":"Drive type"},{"$f":"TypeListTemplate!M5","v":0},{"$f":"TypeListTemplate!N5","v":"Drive type"},{"$f":"TypeListTemplate!O5","v":0},{"$f":"TypeListTemplate!P5","v":"Drive type"},{"$f":"TypeListTemplate!Q5","v":0}]
[{"$f":"TypeListTemplate!A6","v":"Hp"},{"$f":"TypeListTemplate!B6","v":"power kW"}]
{"$rows_left_out":90}
{"sheet":"StdDrives","index":13,"n_rows":95,"n_cols":25,"rows_kept":95,"cut":false,"hidden":true,"merged":[]}
["Typecode","Prod.class",null,"Voltage range 1",null,"Voltage range 2 (1-ph)",null,"Voltage range 2",null,"Voltage range 3",null,"Voltage range 4.6",null,"Voltage range 5",null,"Voltage range 7/6",null,"Voltage range 2k",null,"Voltage range 3k",null,"Voltage range 4k",null,"Voltage range 6k"]
[{"$f":"VLOOKUP(DriveSel!E20,C8:Y71,DriveSel!D18)","v":"ACH550-01-246A-4"},0,"non-US (50Hz)"," 115 V (1-ph)",null," 230 V (1-ph)",null," 230 V (3-ph)",null," 400 V",null," 460 V",null," 500 V",null," 690 V",null," 2,3 kV",null," 3,3 kV",null," 4,16 kV",null," 6,6 kV"]
["Col.ordinal","Col.ordinal"]
[null,null,"Alternatives:","115 V 1-ph",null,"200/208/230/240 V 1-ph",null,"200/208/230/240 V 3-ph",null,"380/400/415 V",null,"440/460/480 V",null,"500 V",null,"525/550/575/600/660/690 V",null,null,null,null,null,"3800/4000/4160V"]
["Motor Power","Motor",null,"Drive type",null,"Drive type",null,"Drive type",null,"Drive type",null,"Drive type",null,"Drive type",null,"Drive type",null,"Drive type",null,"Drive type",null,"Drive type"]
["Hp","power kW"]
{"$rows_left_out":90}
{"sheet":"calcPump","index":14,"n_rows":101,"n_cols":36,"rows_kept":101,"cut":false,"hidden":true,"merged":[[27,33,27,36],[21,33,21,36],[22,33,22,36],[23,33,23,36],[24,33,24,36],[25,33,25,36],[26,33,26,36],[16,33,16,36],[17,33,17,36],[18,33,18,36],[19,33,19,36],[20,33,20,36],[91,1,91,9],[91,10,91,12],[91,13,91,14],[92,1,92,9],[92,10,92,12],[92,13,92,14],[89,1,89,9],[89,10,89,12],[89,13,89,14],[90,1,90,9],[90,10,90,12],[90,13,90,14],[100,1,100,14],[101,1,101,14],[102,1,102,14],[103,1,103,14],[104,1,104,14],[105,1,105,14],[93,1,93,9],[93,10,93,12],[93,13,93,14],[94,1,94,9],[94,10,94,12],[94,13,94,14],[87,1,87,9],[87,10,87,12],[87,13,87,14],[88,1,88,9],[88,10,88,12],[88,13,88,14],[83,12,83,14],[83,15,83,17],[83,18,83,20],[83,21,83,23],[86,1,86,9],[86,10,86,12],[86,13,86,14],[81,12,81,14],[81,15,81,17],[81,18,81,20],[81,21,81,23],[82,12,82,14],[82,15,82,17],[82,18,82,20],[82,21,82,23],[79,12,79,14],[79,15,79,17],[79,18,79,20],[79,21,79,23],[80,12,80,14],[80,15,80,17],[80,18,80,20],[80,21,80,23],[77,1,77,3],[77,12,77,14],[77,15,77,17],[77,18,77,20],[77,21,77,23],[78,12,78,14],[78,15,78,17],[78,18,78,20],[78,21,78,23],[75,1,75,3],[75,12,75,14],[75,15,75,17],[75,18,75,20],[75,21,75,23],[76,1,76,3],[76,12,76,14],[76,15,76,17],[76,18,76,20],[76,21,76,23],[73,1,73,3],[73,12,73,14],[73,15,73,17],[73,18,73,20],[73,21,73,23],[74,1,74,3],[74,12,74,14],[74,15,74,17],[74,18,74,20],[74,21,74,23],[71,1,71,3],[71,12,71,14],[71,15,71,17],[71,18,71,20],[71,21,71,23],[72,1,72,3],[72,12,72,14],[72,15,72,17],[72,18,72,20],[72,21,72,23],[69,15,69,17],[69,18,69,20],[69,21,69,23],[70,1,70,3],[70,12,70,14],[70,15,70,17],[70,18,70,20],[70,21,70,23],[63,4,63,10],[63,11,63,12],[67,8,67,11],[68,1,68,3],[69,1,69,3],[69,12,69,14],[60,4,60,10],[60,11,60,12],[61,4,61,10],[61,11,61,12],[62,4,62,10],[62,11,62,12],[55,23,55,25],[55,26,55,28],[55,29,55,31],[55,32,55,34],[56,9,56,12],[59,4,59,10],[59,11,59,12],[54,29,54,31],[54,32,54,34],[54,35,54,37],[55,2,55,3],[55,4,55,6],[55,7,55,8],[55,9,55,12],[55,13,55,15],[55,16,55,19],[55,20,55,22],[54,2,54,3],[54,4,54,6],[54,7,54,8],[54,9,54,12],[54,13,54,15],[54,16,54,19],[54,20,54,22],[54,23,54,25],[54,26,54,28],[52,29,52,31],[52,32,52,34],[52,35,52,37],[53,2,53,3],[53,4,53,6],[53,7,53,8],[53,9,53,12],[53,13,53,15],[53,35,53,37],[53,16,53,19],[53,20,53,22],[53,23,53,25],[53,26,53,28],[53,29,53,31],[53,32,53,34],[52,2,52,3],[52,4,52,6],[52,7,52,8],[52,9,52,12],[52,13,52,15],[52,16,52,19],[52,20,52,22],[52,23,52,25],[52,26,52,28],[50,2,50,3],[50,4,50,6],[50,7,50,8],[50,9,50,12],[50,13,50,15],[50,35,50,37],[51,2,51,3],[51,4,51,6],[51,7,51,8],[51,9,51,12],[51,13,51,15],[51,16,51,19],[51,20,51,22],[51,23,51,25],[51,26,51,28],[50,16,50,19],[50,20,50,22],[50,23,50,25],[50,26,50,28],[50,29,50,31],[50,32,50,34],[51,29,51,31],[51,32,51,34],[51,35,51,37],[48,29,48,31],[48,32,48,34],[48,35,48,37],[49,2,49,3],[49,4,49,6],[49,7,49,8],[49,9,49,12],[49,13,49,15],[49,16,49,19],[49,20,49,22],[49,23,49,25],[49,26,49,28],[49,29,49,31],[49,32,49,34],[49,35,49,37],[48,2,48,3],[48,4,48,6],[48,7,48,8],[48,9,48,12],[48,13,48,15],[48,16,48,19],[48,20,48,22],[48,23,48,25],[48,26,48,28],[46,29,46,31],[46,32,46,34],[46,35,46,37],[47,2,47,3],[47,4,47,6],[47,7,47,8],[47,9,47,12],[47,13,47,15],[47,35,47,37],[47,16,47,19],[47,20,47,22],[47,23,47,25],[47,26,47,28],[47,29,47,31],[47,32,47,34],[46,2,46,3],[46,4,46,6],[46,7,46,8],[46,9,46,12],[46,13,46,15],[46,16,46,19],[46,20,46,22],[46,23,46,25],[46,26,46,28],[44,2,44,3],[44,4,44,6],[44,7,44,8],[44,9,44,12],[44,13,44,15],[44,35,44,37],[45,2,45,3],[45,4,45,6],[45,7,45,8],[45,9,45,12],[45,13,45,15],[45,16,45,19],[45,20,45,22],[45,23,45,25],[45,26,45,28],[44,16,44,19],[44,20,44,22],[44,23,44,25],[44,26,44,28],[44,29,44,31],[44,32,44,34],[45,29,45,31],[45,32,45,34],[45,35,45,37],[42,29,42,31],[42,32,42,34],[42,35,42,37],[43,2,43,3],[43,4,43,6],[43,7,43,8],[43,9,43,12],[43,13,43,15],[43,16,43,19],[43,20,43,22],[43,26,43,28],[43,29,43,31],[43,32,43,34],[42,2,42,3],[42,4,42,6],[42,7,42,8],[42,9,42,12],[42,13,42,15],[42,16,42,19],[42,20,42,22],[42,23,42,25],[42,26,42,28],[40,35,40,37],[41,2,41,3],[41,4,41,6],[41,7,41,8],[41,9,41,12],[41,13,41,15],[41,16,41,19],[41,20,41,22],[41,23,41,25],[41,26,41,28],[40,16,40,19],[40,20,40,22],[40,23,40,25],[40,26,40,28],[40,29,40,31],[40,32,40,34],[41,29,41,31],[41,32,41,34],[41,35,41,37],[37,2,37,6],[37,7,37,10],[39,9,39,12],[39,13,39,15],[39,16,39,19],[40,2,40,3],[40,4,40,6],[40,7,40,8],[40,9,40,12],[40,13,40,15],[34,2,34,6],[34,7,34,10],[35,2,35,6],[35,7,35,10],[36,2,36,6],[36,7,36,10],[30,2,30,7],[30,8,30,10],[30,11,30,12],[30,13,30,14],[32,2,32,6],[33,2,33,6],[33,7,33,10],[28,30,28,32],[29,2,29,7],[29,8,29,10],[29,11,29,12],[29,13,29,14],[29,26,29,29],[28,2,28,7],[28,8,28,10],[28,11,28,12],[28,13,28,14],[28,22,28,25],[28,26,28,29],[27,2,27,7],[27,8,27,10],[27,11,27,12],[27,13,27,14],[27,22,27,25],[27,26,27,29],[26,2,26,7],[26,8,26,10],[26,11,26,12],[26,13,26,14],[26,22,26,25],[26,26,26,29],[25,2,25,7],[25,8,25,10],[25,11,25,12],[25,13,25,14],[25,22,25,25],[25,26,25,29],[24,2,24,7],[24,8,24,10],[24,11,24,12],[24,13,24,14],[24,22,24,25],[24,26,24,29],[23,2,23,7],[23,8,23,10],[23,11,23,12],[23,13,23,14],[23,22,23,25],[23,26,23,29],[22,2,22,7],[22,8,22,10],[22,11,22,12],[22,13,22,14],[22,22,22,25],[22,26,22,29],[21,2,21,7],[21,8,21,10],[21,11,21,12],[21,13,21,14],[21,22,21,25],[21,26,21,29],[18,22,18,25],[18,26,18,29],[19,22,19,25],[19,26,19,29],[20,2,20,7],[20,8,20,10],[20,11,20,12],[20,13,20,14],[20,22,20,25],[20,26,20,29],[16,1,16,9],[16,10,16,12],[16,13,16,14],[16,15,16,16],[16,17,16,18],[16,22,16,25],[16,26,16,29],[17,1,17,9],[17,10,17,12],[17,13,17,14],[17,15,17,16],[17,17,17,18],[17,22,17,25],[17,26,17,29],[14,1,14,9],[14,10,14,12],[14,13,14,14],[14,15,14,16],[14,17,14,18],[15,1,15,9],[15,10,15,12],[15,13,15,14],[15,15,15,16],[15,17,15,18],[12,1,12,9],[12,10,12,12],[12,13,12,14],[12,15,12,16],[12,17,12,18],[13,1,13,9],[13,10,13,12],[13,13,13,14],[13,15,13,16],[13,17,13,18],[10,34,10,37],[11,1,11,9],[11,10,11,12],[11,13,11,14],[11,15,11,16],[11,17,11,18],[11,20,11,27],[11,28,11,29],[11,30,11,31],[11,32,11,33],[11,34,11,37],[10,1,10,9],[10,10,10,12],[10,13,10,14],[10,15,10,16],[10,17,10,18],[10,20,10,27],[10,28,10,29],[10,30,10,31],[10,32,10,33],[0,1,0,2],[1,1,1,15],[8,28,8,29],[8,30,8,31],[8,32,8,33],[8,34,8,37],[9,1,9,9],[9,10,9,12],[9,13,9,14],[9,15,9,16],[9,17,9,18],[9,20,9,27],[8,1,8,9],[8,10,8,12],[8,13,8,14],[8,15,8,16],[8,17,8,18],[8,20,8,27],[9,28,9,29],[9,30,9,31],[9,32,9,33],[9,34,9,37]]}
[null,"ABB",null,null,null,null,null,null,null,null,null,null,null,null,"ENERGY SAVINGS OF A PUMP DRIVE"]
[null,"Frequency Converter Control compared with Traditional Control methods"]
[null,null,null,null,null,null,null,null,null,null,null,null,null,null,null,"On/Off säätö"]
[null,null,null,null,null,null,null,null,null,null,null,null,null,null,null,"Jättämäsäätö"]
[]
[]
{"$rows_left_out":96}
{"sheet":"Settings","index":15,"n_rows":31,"n_cols":5,"rows_kept":31,"cut":false,"hidden":true,"merged":[]}
["Field or component","Minimum value","Maximum value","Content or default value","Value Entered"]
[]
["Input_NominalFlow",0,9999999,1100,1100]
["Input_NominalHead",0,4000,33,33]
["Input_MaxHead",0,5000,44,44]
["Input_Efficiency",0,100,88,88]
{"$rows_left_out":25}